{"text_format":"1","workbook":"xlsx","n_sheets":10,"sheets":["Kämpfe","2026","2025","2024","2023","2022","2021","2020","2019","2018"],"not_rendered":{"charts":0,"images":1,"macros":1,"external_links":0,"defined_names":11,"comments":0,"pivot_tables":0},"unopened":[],"bounds":{"document_bytes":16777216,"sheet_cells":100000,"rows_first":2000,"rows_last":500,"rows_between":2000,"halvings":0,"cell_chars":16384,"cell_head_chars":4096},"cells_cut":0,"cells_raw":0,"read":"whole","date_system":"1900"}

{"sheet":"Kämpfe","index":0,"n_rows":727,"n_cols":12,"rows_kept":727,"cut":false,"hidden":false,"merged":[[1,1,1,3],[1,4,1,6]]}
[null,null,null,null,null,null,null,null,"Kuh Nr.",null,"Anzahl Kämpfe","Gewonnen"]
[null,"Gewinner",null,null,"Verlierer",null,null,null,null,null,{"$f":"COUNTIFS($D$4:$E$3323,$I$2)","v":0},{"$f":"COUNTIFS($D$4:$D$3323,$I$2)","v":0}]
["Datum","Besitzer","Name","Nr.","Nr.2","Name2","Besitzer2"]
["2026-07-19",{"$f":"IF(ISBLANK(D4),\"Alain, nix drischribu\",VLOOKUP(D4,'2026'!$A$16:$G$161,3,FALSE))","v":"Williner Anton"},{"$f":"VLOOKUP(D4,'2026'!$A$16:$B$161,2,FALSE)","v":"Venus"},76,9,{"$f":"VLOOKUP(E4,'2026'!$A$16:$G$161,2,FALSE)","v":"Banja"},{"$f":"IF(ISBLANK(E4),\"hie eu nix drischribu\",VLOOKUP(E4,'2026'!$A$16:$G$161,3,FALSE))","v":"Bregy Alain"}]
["2026-07-19",{"$f":"IF(ISBLANK(D5),\"Alain, nix drischribu\",VLOOKUP(D5,'2026'!$A$16:$G$161,3,FALSE))","v":"Gebrüder Jäger"},{"$f":"VLOOKUP(D5,'2026'!$A$16:$B$161,2,FALSE)","v":"Soraya"},23,57,{"$f":"VLOOKUP(E5,'2026'!$A$16:$G$161,2,FALSE)","v":"Bogota"},{"$f":"IF(ISBLANK(E5),\"hie eu nix drischribu\",VLOOKUP(E5,'2026'!$A$16:$G$161,3,FALSE))","v":"Stallung Jäger & Tscherrig"}]
["2026-07-19",{"$f":"IF(ISBLANK(D6),\"Alain, nix drischribu\",VLOOKUP(D6,'2026'!$A$16:$G$161,3,FALSE))","v":"Bregy Uli, Lisi & Pascal"},{"$f":"VLOOKUP(D6,'2026'!$A$16:$B$161,2,FALSE)","v":"Samba"},14,75,{"$f":"VLOOKUP(E6,'2026'!$A$16:$G$161,2,FALSE)","v":"Baldrun"},{"$f":"IF(ISBLANK(E6),\"hie eu nix drischribu\",VLOOKUP(E6,'2026'!$A$16:$G$161,3,FALSE))","v":"Stallung Passeraub"}]
["2026-07-19",{"$f":"IF(ISBLANK(D7),\"Alain, nix drischribu\",VLOOKUP(D7,'2026'!$A$16:$G$161,3,FALSE))","v":"Zumofen / Gattlen"},{"$f":"VLOOKUP(D7,'2026'!$A$16:$B$161,2,FALSE)","v":"Vesuv"},84,19,{"$f":"VLOOKUP(E7,'2026'!$A$16:$G$161,2,FALSE)","v":"Colette"},{"$f":"IF(ISBLANK(E7),\"hie eu nix drischribu\",VLOOKUP(E7,'2026'!$A$16:$G$161,3,FALSE))","v":"Familie Leiggener"}]
["2026-07-19",{"$f":"IF(ISBLANK(D8),\"Alain, nix drischribu\",VLOOKUP(D8,'2026'!$A$16:$G$161,3,FALSE))","v":"Gebrüder Jäger"},{"$f":"VLOOKUP(D8,'2026'!$A$16:$B$161,2,FALSE)","v":"Luna"},28,40,{"$f":"VLOOKUP(E8,'2026'!$A$16:$G$161,2,FALSE)","v":"Pandora"},{"$f":"IF(ISBLANK(E8),\"hie eu nix drischribu\",VLOOKUP(E8,'2026'!$A$16:$G$161,3,FALSE))","v":"Lötscher Sandrine & Cédric"}]
["2026-07-19",{"$f":"IF(ISBLANK(D9),\"Alain, nix drischribu\",VLOOKUP(D9,'2026'!$A$16:$G$161,3,FALSE))","v":"Stallung Passeraub"},{"$f":"VLOOKUP(D9,'2026'!$A$16:$B$161,2,FALSE)","v":"Bandera"},69,20,{"$f":"VLOOKUP(E9,'2026'!$A$16:$G$161,2,FALSE)","v":"Tirana"},{"$f":"IF(ISBLANK(E9),\"hie eu nix drischribu\",VLOOKUP(E9,'2026'!$A$16:$G$161,3,FALSE))","v":"Familie Leiggener"}]
["2026-07-19",{"$f":"IF(ISBLANK(D10),\"Alain, nix drischribu\",VLOOKUP(D10,'2026'!$A$16:$G$161,3,FALSE))","v":"Zumofen / Gattlen"},{"$f":"VLOOKUP(D10,'2026'!$A$16:$B$161,2,FALSE)","v":"Fame"},87,63,{"$f":"VLOOKUP(E10,'2026'!$A$16:$G$161,2,FALSE)","v":"Mistral"},{"$f":"IF(ISBLANK(E10),\"hie eu nix drischribu\",VLOOKUP(E10,'2026'!$A$16:$G$161,3,FALSE))","v":"Stallung Mussmann"}]
["2026-07-19",{"$f":"IF(ISBLANK(D11),\"Alain, nix drischribu\",VLOOKUP(D11,'2026'!$A$16:$G$161,3,FALSE))","v":"Hischier H. & Bühlmann J."},{"$f":"VLOOKUP(D11,'2026'!$A$16:$B$161,2,FALSE)","v":"Tara"},44,36,{"$f":"VLOOKUP(E11,'2026'!$A$16:$G$161,2,FALSE)","v":"Perle"},{"$f":"IF(ISBLANK(E11),\"hie eu nix drischribu\",VLOOKUP(E11,'2026'!$A$16:$G$161,3,FALSE))","v":"Lötscher Sandrine & Cédric"}]
["2026-07-19",{"$f":"IF(ISBLANK(D12),\"Alain, nix drischribu\",VLOOKUP(D12,'2026'!$A$16:$G$161,3,FALSE))","v":"Zumofen / Gattlen"},{"$f":"VLOOKUP(D12,'2026'!$A$16:$B$161,2,FALSE)","v":"Calcuta"},90,13,{"$f":"VLOOKUP(E12,'2026'!$A$16:$G$161,2,FALSE)","v":"Cora"},{"$f":"IF(ISBLANK(E12),\"hie eu nix drischribu\",VLOOKUP(E12,'2026'!$A$16:$G$161,3,FALSE))","v":"Bregy Uli, Lisi & Pascal"}]
["2026-07-19",{"$f":"IF(ISBLANK(D13),\"Alain, nix drischribu\",VLOOKUP(D13,'2026'!$A$16:$G$161,3,FALSE))","v":"Zumofen / Gattlen"},{"$f":"VLOOKUP(D13,'2026'!$A$16:$B$161,2,FALSE)","v":"Rigolo"},83,86,{"$f":"VLOOKUP(E13,'2026'!$A$16:$G$161,2,FALSE)","v":"Roquette"},{"$f":"IF(ISBLANK(E13),\"hie eu nix drischribu\",VLOOKUP(E13,'2026'!$A$16:$G$161,3,FALSE))","v":"Zumofen / Gattlen"}]
["2026-07-19",{"$f":"IF(ISBLANK(D14),\"Alain, nix drischribu\",VLOOKUP(D14,'2026'!$A$16:$G$161,3,FALSE))","v":"Familie Leiggener"},{"$f":"VLOOKUP(D14,'2026'!$A$16:$B$161,2,FALSE)","v":"Colette"},19,76,{"$f":"VLOOKUP(E14,'2026'!$A$16:$G$161,2,FALSE)","v":"Venus"},{"$f":"IF(ISBLANK(E14),\"hie eu nix drischribu\",VLOOKUP(E14,'2026'!$A$16:$G$161,3,FALSE))","v":"Williner Anton"}]
["2026-07-19",{"$f":"IF(ISBLANK(D15),\"Alain, nix drischribu\",VLOOKUP(D15,'2026'!$A$16:$G$161,3,FALSE))","v":"Stallung Jäger & Tscherrig"},{"$f":"VLOOKUP(D15,'2026'!$A$16:$B$161,2,FALSE)","v":"Myla"},55,3,{"$f":"VLOOKUP(E15,'2026'!$A$16:$G$161,2,FALSE)","v":"Pegasus"},{"$f":"IF(ISBLANK(E15),\"hie eu nix drischribu\",VLOOKUP(E15,'2026'!$A$16:$G$161,3,FALSE))","v":"Bayard Medard & Gustav"}]
{"$rows_left_out":713}
{"sheet":"2026","index":1,"n_rows":145,"n_cols":12,"rows_kept":145,"cut":false,"hidden":false,"merged":[[130,9,131,9],[132,0,133,0],[132,1,133,1],[132,2,133,2],[132,3,133,3],[132,4,133,4],[132,5,133,5],[132,6,133,6],[136,7,137,7],[136,8,137,8],[136,9,137,9],[132,7,133,7],[132,8,133,8],[132,9,133,9],[136,0,137,0],[136,1,137,1],[136,2,137,2],[136,3,137,3],[136,4,137,4],[136,5,137,5],[136,6,137,6],[130,0,131,0],[130,1,131,1],[130,2,131,2],[130,3,131,3],[130,4,131,4],[130,5,131,5],[130,6,131,6],[130,7,131,7],[130,8,131,8],[126,9,127,9],[128,0,129,0],[128,1,129,1],[128,2,129,2],[128,3,129,3],[128,4,129,4],[128,5,129,5],[128,6,129,6],[128,7,129,7],[128,8,129,8],[128,9,129,9],[126,0,127,0],[126,1,127,1],[126,2,127,2],[126,3,127,3],[126,4,127,4],[126,5,127,5],[126,6,127,6],[126,7,127,7],[126,8,127,8],[119,9,121,9],[122,0,125,0],[122,1,125,1],[122,2,125,2],[122,3,125,3],[122,4,125,4],[122,5,125,5],[122,6,125,6],[122,7,125,7],[122,8,125,8],[122,9,125,9],[119,0,121,0],[119,1,121,1],[119,2,121,2],[119,3,121,3],[119,4,121,4],[119,5,121,5],[119,6,121,6],[119,7,121,7],[119,8,121,8],[112,0,118,0],[112,1,118,1],[112,2,118,2],[112,3,118,3],[112,5,118,5],[112,6,118,6],[112,7,118,7],[112,8,118,8],[112,9,118,9],[100,9,101,9],[108,0,109,0],[108,1,109,1],[108,2,109,2],[108,3,109,3],[108,4,109,4],[108,5,109,5],[108,6,109,6],[108,7,109,7],[108,8,109,8],[108,9,109,9],[100,0,101,0],[100,1,101,1],[100,2,101,2],[100,3,101,3],[100,4,101,4],[100,5,101,5],[100,6,101,6],[100,7,101,7],[100,8,101,8],[94,9,95,9],[98,0,99,0],[98,1,99,1],[98,2,99,2],[98,3,99,3],[98,4,99,4],[98,5,99,5],[98,6,99,6],[98,7,99,7],[98,8,99,8],[98,9,99,9],[94,0,95,0],[94,1,95,1],[94,2,95,2],[94,3,95,3],[94,4,95,4],[94,5,95,5],[94,6,95,6],[94,7,95,7],[94,8,95,8],[88,9,89,9],[90,0,93,0],[90,1,93,1],[90,2,93,2],[90,3,93,3],[90,4,93,4],[90,5,93,5],[90,6,93,6],[90,7,93,7],[90,8,93,8],[90,9,93,9],[88,0,89,0],[88,1,89,1],[88,2,89,2],[88,3,89,3],[88,4,89,4],[88,5,89,5],[88,6,89,6],[88,7,89,7],[88,8,89,8],[75,9,76,9],[77,0,78,0],[77,1,78,1],[77,2,78,2],[77,3,78,3],[77,4,78,4],[77,5,78,5],[77,6,78,6],[77,7,78,7],[77,8,78,8],[77,9,78,9],[75,0,76,0],[75,1,76,1],[75,2,76,2],[75,3,76,3],[75,4,76,4],[75,5,76,5],[75,6,76,6],[75,7,76,7],[75,8,76,8],[67,9,68,9],[69,0,71,0],[69,1,71,1],[69,2,71,2],[69,3,71,3],[69,4,71,4],[69,5,71,5],[69,6,71,6],[69,7,71,7],[69,8,71,8],[69,9,71,9],[67,0,68,0],[67,1,68,1],[67,2,68,2],[67,3,68,3],[67,4,68,4],[67,5,68,5],[67,6,68,6],[67,7,68,7],[67,8,68,8],[38,9,39,9],[38,10,39,10],[40,0,41,0],[40,1,41,1],[40,2,41,2],[40,3,41,3],[40,4,41,4],[40,5,41,5],[40,6,41,6],[40,7,41,7],[40,8,41,8],[40,9,41,9],[40,10,41,10],[38,0,39,0],[38,1,39,1],[38,2,39,2],[38,3,39,3],[38,4,39,4],[38,5,39,5],[38,6,39,6],[38,7,39,7],[38,8,39,8],[0,0,0,11],[2,0,2,11],[25,0,26,0],[25,1,26,1],[25,2,26,2],[25,3,26,3],[25,4,26,4],[25,5,26,5],[25,6,26,6],[25,7,26,7],[25,8,26,8],[25,9,26,9]]}
["ALPE ROTIGEN TURTMANNTAL"]
[]
["Alpaufzug vom 13. Juni 2026"]
[]
[null,null,"Trupposiegerin",93,null,null,"Tiere",null,null,"2025 klassiert und nicht da"]
[]
[null,null,"Klassiert 2025",21,null,"IV","Erstmelken",null,null,"Cashida Bregy Ralf & Adolf (8.)"]
[null,null,null,null,null,null,null,null,null,"Champion Bregy Ralf & Adolf (10.)"]
[null,null,"Königin 2025",18,null,"II","Zweitmelken",null,null,"Canabis Bregy Ralf & Adolf (10.)"]
[null,null,null,null,null,null,null,null,null,"Lorens Gebrüder Jäger (12.)"]
[null,null,null,36,null,"N","Neu (2025 nicht da)",null,null,"Diabolo Bregy Anja (13.)"]
[]
[null,null,null,42,null,null,"Glocken an Ringkuhkämpfen"]
[]
[null,null,null,32,null,null,"Klassierte Tiere an Ringkuhkämpfen"]
{"$rows_left_out":131}
{"sheet":"2025","index":2,"n_rows":164,"n_cols":12,"rows_kept":164,"cut":false,"hidden":false,"merged":[[27,9,31,9],[32,6,34,6],[32,7,34,7],[32,8,34,8],[32,9,34,9],[0,0,0,11],[2,0,2,11],[24,0,25,0],[24,1,25,1],[24,2,25,2],[24,3,25,3],[24,4,25,4],[24,5,25,5],[24,6,25,6],[24,7,25,7],[24,8,25,8],[24,9,25,9],[32,0,34,0],[32,1,34,1],[32,2,34,2],[32,3,34,3],[32,4,34,4],[32,5,34,5],[27,0,31,0],[27,1,31,1],[27,2,31,2],[27,3,31,3],[35,6,37,6],[35,7,37,7],[35,8,37,8],[27,6,31,6],[27,7,31,7],[27,8,31,8],[64,5,65,5],[69,0,70,0],[69,1,70,1],[69,2,70,2],[69,3,70,3],[69,4,70,4],[69,5,70,5],[35,9,37,9],[39,0,41,0],[39,1,41,1],[39,2,41,2],[39,3,41,3],[39,4,41,4],[39,5,41,5],[35,0,37,0],[35,1,37,1],[35,2,37,2],[35,3,37,3],[35,4,37,4],[35,5,37,5],[39,6,41,6],[39,7,41,7],[39,8,41,8],[39,9,41,9],[78,0,82,0],[78,1,82,1],[78,2,82,2],[78,3,82,3],[78,4,82,4],[64,0,65,0],[64,1,65,1],[64,2,65,2],[64,3,65,3],[64,4,65,4],[66,5,67,5],[66,6,67,6],[66,7,67,7],[66,8,67,8],[66,9,67,9],[69,6,70,6],[69,7,70,7],[69,8,70,8],[69,9,70,9],[98,7,99,7],[98,8,99,8],[83,0,85,0],[83,1,85,1],[83,2,85,2],[83,3,85,3],[83,4,85,4],[66,10,67,10],[64,6,65,6],[64,7,65,7],[64,8,65,8],[64,9,65,9],[64,10,65,10],[69,10,70,10],[78,5,82,5],[78,6,82,6],[78,7,82,7],[78,8,82,8],[78,9,82,9],[66,0,67,0],[66,1,67,1],[66,2,67,2],[66,3,67,3],[66,4,67,4],[100,0,101,0],[100,1,101,1],[100,2,101,2],[100,3,101,3],[100,4,101,4],[100,5,101,5],[98,9,99,9],[98,10,99,10],[83,5,85,5],[83,6,85,6],[83,7,85,7],[83,8,85,8],[83,9,85,9],[100,6,101,6],[100,7,101,7],[100,8,101,8],[100,9,101,9],[98,0,99,0],[98,1,99,1],[98,2,99,2],[98,3,99,3],[98,4,99,4],[98,5,99,5],[98,6,99,6],[102,6,103,6],[102,7,103,7],[102,8,103,8],[102,9,103,9],[117,0,119,0],[117,1,119,1],[117,2,119,2],[117,3,119,3],[117,4,119,4],[117,5,119,5],[117,6,119,6],[117,7,119,7],[117,8,119,8],[117,9,119,9],[102,0,103,0],[102,1,103,1],[102,2,103,2],[102,3,103,3],[102,4,103,4],[102,5,103,5],[132,9,133,9],[134,0,139,0],[134,1,139,1],[134,2,139,2],[134,3,139,3],[134,4,139,4],[134,5,139,5],[134,6,139,6],[134,7,139,7],[134,8,139,8],[134,9,139,9],[132,0,133,0],[132,1,133,1],[132,2,133,2],[132,3,133,3],[132,4,133,4],[132,5,133,5],[132,6,133,6],[132,7,133,7],[132,8,133,8],[140,9,142,9],[143,0,144,0],[143,1,144,1],[143,2,144,2],[143,3,144,3],[143,4,144,4],[143,5,144,5],[143,6,144,6],[143,7,144,7],[143,8,144,8],[143,9,144,9],[140,0,142,0],[140,1,142,1],[140,2,142,2],[140,3,142,3],[140,4,142,4],[140,5,142,5],[140,6,142,6],[140,7,142,7],[140,8,142,8],[145,9,147,9],[148,0,149,0],[148,1,149,1],[148,2,149,2],[148,3,149,3],[148,4,149,4],[148,5,149,5],[148,6,149,6],[148,7,149,7],[148,8,149,8],[148,9,149,9],[145,0,147,0],[145,1,147,1],[145,2,147,2],[145,3,147,3],[145,4,147,4],[145,5,147,5],[145,6,147,6],[145,7,147,7],[145,8,147,8],[155,9,156,9],[150,6,151,6],[150,7,151,7],[150,8,151,8],[150,9,151,9],[155,0,156,0],[155,1,156,1],[155,2,156,2],[155,3,156,3],[155,4,156,4],[155,5,156,5],[150,0,151,0],[150,1,151,1],[150,2,151,2],[150,3,151,3],[150,4,151,4],[150,5,151,5],[155,6,156,6],[155,7,156,7],[155,8,156,8]]}
["ALPE ROTIGEN TURTMANNTAL"]
[]
["Alpaufzug vom 14. Juni 2025"]
[]
[null,null,"Trupposiegerin",105,null,null,"Tiere",null,null,"2024 klassiert und nicht da"]
[]
[null,null,"Klassiert 2024",29,null,"IV","Erstmelken",null,null,"Ballerine Stallung Passeraub (6.)"]
[null,null,null,null,null,null,null,null,null,"Violette Zumofen / Gattlen (8.)"]
[null,null,"Königin 2024",19,null,"II","Zweitmelken",null,null,"Coquette Bregy Ralf & Adolf (10.)"]
[null,null,null,null,null,null,null,null,null,"Sera Stallung Jäger & Tscherrig (12.)"]
[null,null,null,42,null,"N","Neu (2024 nicht da)"]
[]
[null,null,null,54,null,null,"Glocken an Ringkuhkämpfen"]
[]
[null,null,null,37,null,null,"Klassierte Tiere an Ringkuhkämpfen"]
{"$rows_left_out":150}
{"sheet":"2024","index":3,"n_rows":150,"n_cols":12,"rows_kept":150,"cut":false,"hidden":false,"merged":[[0,0,0,11],[2,0,2,11],[24,0,27,0],[24,1,27,1],[24,2,27,2],[24,3,27,3],[24,6,27,6],[24,7,27,7],[140,7,141,7],[140,8,141,8],[65,6,68,6],[65,7,68,7],[65,8,68,8],[55,7,56,7],[28,8,29,8],[24,8,27,8],[24,9,27,9],[28,0,29,0],[28,1,29,1],[28,2,29,2],[28,3,29,3],[28,4,29,4],[28,5,29,5],[28,6,29,6],[28,7,29,7],[28,9,29,9],[30,0,31,0],[30,1,31,1],[30,2,31,2],[30,3,31,3],[30,4,31,4],[30,5,31,5],[30,6,31,6],[30,7,31,7],[30,8,31,8],[30,9,31,9],[32,9,33,9],[34,0,35,0],[34,1,35,1],[34,2,35,2],[34,3,35,3],[34,4,35,4],[34,5,35,5],[34,6,35,6],[34,7,35,7],[34,8,35,8],[34,9,35,9],[32,0,33,0],[32,1,33,1],[32,2,33,2],[32,3,33,3],[32,4,33,4],[32,5,33,5],[32,6,33,6],[32,7,33,7],[32,8,33,8],[46,9,47,9],[46,10,47,10],[48,0,49,0],[48,1,49,1],[48,2,49,2],[48,3,49,3],[48,4,49,4],[48,5,49,5],[48,6,49,6],[48,7,49,7],[48,8,49,8],[48,9,49,9],[48,10,49,10],[46,0,47,0],[46,1,47,1],[46,2,47,2],[46,3,47,3],[46,4,47,4],[46,5,47,5],[46,6,47,6],[46,7,47,7],[46,8,47,8],[55,10,56,10],[58,0,59,0],[58,1,59,1],[58,2,59,2],[58,3,59,3],[58,4,59,4],[58,5,59,5],[58,6,59,6],[58,7,59,7],[58,8,59,8],[58,9,59,9],[58,10,59,10],[55,0,56,0],[55,1,56,1],[55,2,56,2],[55,3,56,3],[55,4,56,4],[55,5,56,5],[55,6,56,6],[55,8,56,8],[55,9,56,9],[65,0,68,0],[65,1,68,1],[65,2,68,2],[65,3,68,3],[65,4,68,4],[65,5,68,5],[65,9,68,9],[69,0,71,0],[69,1,71,1],[69,2,71,2],[69,3,71,3],[69,4,71,4],[69,5,71,5],[69,6,71,6],[69,7,71,7],[69,8,71,8],[69,9,71,9],[87,9,92,9],[96,0,97,0],[96,1,97,1],[96,2,97,2],[96,3,97,3],[96,4,97,4],[96,5,97,5],[96,6,97,6],[96,7,97,7],[96,8,97,8],[96,9,97,9],[87,0,92,0],[87,1,92,1],[87,2,92,2],[87,3,92,3],[87,4,92,4],[87,5,92,5],[87,6,92,6],[87,7,92,7],[87,8,92,8],[96,10,97,10],[103,0,106,0],[103,1,106,1],[103,2,106,2],[103,3,106,3],[103,4,106,4],[103,5,106,5],[103,6,106,6],[103,7,106,7],[103,8,106,8],[103,9,106,9],[109,9,111,9],[116,0,117,0],[116,1,117,1],[116,2,117,2],[116,3,117,3],[116,4,117,4],[116,5,117,5],[116,6,117,6],[116,7,117,7],[116,8,117,8],[116,9,117,9],[109,0,111,0],[109,1,111,1],[109,2,111,2],[109,3,111,3],[109,4,111,4],[109,5,111,5],[109,6,111,6],[109,7,111,7],[109,8,111,8],[126,9,127,9],[126,10,127,10],[130,0,131,0],[130,1,131,1],[130,2,131,2],[130,3,131,3],[130,4,131,4],[130,5,131,5],[130,6,131,6],[130,7,131,7],[130,8,131,8],[130,9,131,9],[126,0,127,0],[126,1,127,1],[126,2,127,2],[126,3,127,3],[126,4,127,4],[126,5,127,5],[126,6,127,6],[126,7,127,7],[126,8,127,8],[132,0,136,0],[132,1,136,1],[132,2,136,2],[132,3,136,3],[132,4,136,4],[132,5,136,5],[132,6,136,6],[140,9,141,9],[132,7,136,7],[132,8,136,8],[132,9,136,9],[140,0,141,0],[140,1,141,1],[140,2,141,2],[140,3,141,3],[140,4,141,4],[140,5,141,5],[140,6,141,6]]}
["ALPE ROTIGEN TURTMANNTAL"]
[]
["Alpaufzug vom 15. Juni 2024"]
[]
[null,null,"Trupposiegerin",96,null,null,"Tiere",null,null,"2023 klassiert und nicht da"]
[]
[null,null,"Klassiert 2023",21,null,"IV","Erstmelken",null,null,"Canaille Bregy Ralf & Adolf (8 te)"]
[null,null,null,null,null,null,null,null,null,"Creola Bregy Ralf & Adolf (11 te)"]
[null,null,"Königin 2023",33,null,"N","Neu (2023 nicht da)",null,null,"Megane Jäger Carlo & Lukas (15 te)"]
[]
[null,null,null,48,null,null,"Glocken an Ringkuhkämpfen"]
[]
[null,null,null,33,null,null,"Klassierte Tiere an Ringkuhkämpfen"]
[]
["Nr.","Name","Besitzer","Ort",null,null,"Geb.","BDTA","Mutter","Vater","Klassierungen Alpe","Klassierungen Match"]
{"$rows_left_out":136}
{"sheet":"2023","index":4,"n_rows":166,"n_cols":13,"rows_kept":166,"cut":false,"hidden":false,"merged":[[0,0,0,12],[2,0,2,12],[21,0,27,0],[21,1,27,1],[21,3,27,3],[21,4,27,4],[21,7,27,7],[21,8,27,8],[21,9,27,9],[21,10,27,10],[28,9,34,9],[28,10,34,10],[36,0,38,0],[36,1,38,1],[36,3,38,3],[36,4,38,4],[36,7,38,7],[36,8,38,8],[36,9,38,9],[36,10,38,10],[28,0,34,0],[28,1,34,1],[28,3,34,3],[28,4,34,4],[28,7,34,7],[28,8,34,8],[39,9,40,9],[39,10,40,10],[42,0,43,0],[42,1,43,1],[42,3,43,3],[42,4,43,4],[42,7,43,7],[42,8,43,8],[42,9,43,9],[42,10,43,10],[39,0,40,0],[39,1,40,1],[39,3,40,3],[39,4,40,4],[39,7,40,7],[39,8,40,8],[44,9,45,9],[44,10,45,10],[52,0,54,0],[52,1,54,1],[52,3,54,3],[52,4,54,4],[52,7,54,7],[52,8,54,8],[52,9,54,9],[52,10,54,10],[44,0,45,0],[44,1,45,1],[44,3,45,3],[44,4,45,4],[44,7,45,7],[44,8,45,8],[53,16,54,16],[55,0,57,0],[55,1,57,1],[55,3,57,3],[55,4,57,4],[55,7,57,7],[55,8,57,8],[55,9,57,9],[55,10,57,10],[67,9,68,9],[67,10,68,10],[70,0,71,0],[70,1,71,2],[70,3,71,3],[70,4,71,4],[70,7,71,7],[70,8,71,8],[70,9,71,9],[70,10,71,10],[67,0,68,0],[67,1,68,1],[67,3,68,3],[67,4,68,4],[67,7,68,7],[67,8,68,8],[77,9,79,9],[77,10,79,10],[80,0,81,0],[80,1,81,1],[80,3,81,3],[80,4,81,4],[80,7,81,7],[80,8,81,8],[80,9,81,9],[80,10,81,10],[77,0,79,0],[77,1,79,1],[77,3,79,3],[77,4,79,4],[77,7,79,7],[77,8,79,8],[97,9,101,9],[97,10,101,10],[114,0,115,0],[114,1,115,1],[114,3,115,3],[114,4,115,4],[114,7,115,7],[114,8,115,8],[114,9,115,9],[114,10,115,10],[97,0,101,0],[97,1,101,1],[97,3,101,3],[97,4,101,4],[97,7,101,7],[97,8,101,8],[123,9,125,9],[123,10,125,10],[136,0,138,0],[136,1,138,1],[136,3,138,3],[136,4,138,4],[136,7,138,7],[136,8,138,8],[136,9,138,9],[136,10,138,10],[123,0,125,0],[123,1,125,1],[123,3,125,3],[123,4,125,4],[123,7,125,7],[123,8,125,8],[155,9,158,9],[155,10,158,10],[155,0,158,0],[155,1,158,1],[155,3,158,3],[155,4,158,4],[155,7,158,7],[155,8,158,8],[139,9,141,9],[139,10,141,10],[153,0,154,0],[153,1,154,1],[153,3,154,3],[153,4,154,4],[153,7,154,7],[153,8,154,8],[153,9,154,9],[153,10,154,10],[139,0,141,0],[139,1,141,1],[139,3,141,3],[139,4,141,4],[139,7,141,7],[139,8,141,8]]}
["ALPE ROTIGEN TURTMANNTAL"]
[]
["Alpaufzug vom 17. Juni 2023"]
[]
[null,null,null,"Trupposiegerin",105,null,null,"Tiere",null,null,"2022 klassiert und nicht da"]
[]
[null,null,null,"Klassiert 2022",23,null,"IV","Erstmelken",null,null,"Milow Bregy Silvan & Patrick (9 te)"]
[null,null,null,null,null,null,null,null,null,null,"Tequila Bregy Silvan & Patrick (12 te)"]
[null,null,null,"Königin 2022",35,null,"N","Neu (2022 nicht da)"]
[]
[null,null,null,null,49,null,null,"Glocken an Ringkuhkämpfen"]
[]
[null,null,null,null,34,null,null,"Klassierte Tiere an Ringkuhkämpfen"]
[]
["Nr.","Name",null,"Besitzer","Ort",null,null,"Geb.","BDTA","Mutter","Vater","Klassierungen Alpe","Klassierungen Match"]
{"$rows_left_out":152}
{"sheet":"2022","index":5,"n_rows":165,"n_cols":13,"rows_kept":165,"cut":false,"hidden":false,"merged":[[145,0,147,0],[145,1,147,1],[145,7,147,7],[125,10,127,10],[128,0,130,0],[128,1,130,1],[128,3,130,3],[128,4,130,4],[128,7,130,7],[128,8,130,8],[128,9,130,9],[128,10,130,10],[108,8,109,8],[108,9,109,9],[108,10,109,10],[125,0,127,0],[125,1,127,1],[125,3,127,3],[125,4,127,4],[125,7,127,7],[125,8,127,8],[125,9,127,9],[108,0,109,0],[108,1,109,1],[108,3,109,3],[108,4,109,4],[108,7,109,7],[69,8,70,8],[69,9,70,9],[69,10,70,10],[92,1,94,1],[92,4,94,4],[92,7,94,7],[69,0,70,0],[69,1,70,1],[69,3,70,3],[69,4,70,4],[69,7,70,7],[46,7,47,7],[46,8,47,8],[46,9,47,9],[46,10,47,10],[58,0,59,0],[58,1,59,1],[58,3,59,3],[58,4,59,4],[58,7,59,7],[58,8,59,8],[46,4,47,4],[58,9,59,9],[58,10,59,10],[43,0,45,0],[43,1,45,1],[46,0,47,0],[46,1,47,1],[46,3,47,3],[35,8,36,8],[35,9,36,9],[35,10,36,10],[31,0,34,0],[31,1,34,1],[31,3,34,3],[31,4,34,4],[35,0,36,0],[35,1,36,1],[35,3,36,3],[35,4,36,4],[35,7,36,7],[31,7,34,7],[31,8,34,8],[31,9,34,9],[31,10,34,10],[28,0,29,0],[28,1,29,1],[28,3,29,3],[28,4,29,4],[28,7,29,7],[17,0,21,0],[17,1,21,1],[17,3,21,3],[17,4,21,4],[17,7,21,7],[22,0,26,0],[22,1,26,1],[22,3,26,3],[22,4,26,4],[22,7,26,7],[17,8,21,8],[32,12,34,12],[17,9,21,9],[17,10,21,10],[18,12,21,12],[22,8,26,8],[22,9,26,9],[22,10,26,10],[23,12,26,12],[28,8,29,8],[28,9,29,9],[28,10,29,10],[28,11,29,11]]}
["Alpe Rotigen Turtmanntal"]
[]
["Alpaufzug vom xx Juni 2022"]
[]
[null,null,null,"Trupposiegerin",124,null,null,"Tiere",null,null,"Klassiert 2021 und nicht da"]
[]
[null,null,null,"Klassiert 2021",25,null,"IV","Erstmelken",null,null,"Flacari, Bregy Ralf und Adolf (7em)"]
[]
[null,null,null,null,36,null,"N","Neu (Nicht da 2020)"]
[]
["Nr.","Name",null,"Besitzer","Ort",null,null,"Geb.","BDTA","Mutter","Vater","Klassierungen Alpe","Klassierungen Match"]
[1,"Venus",null,"Bayard Medard & Gustav","N'Gampel",null,null,"2014-11-01","120.0618.4532.6","Violette","@MAC"]
[2,"Fantastic",null,"Bayard Medard & Gustav","N'Gampel",null,null,"2015-12-01","120.1201.9792.2","Chinook","#CAPO","4te IV Rotigen 19"]
[3,"Priska",null,"Bayard Medard & Gustav","N'Gampel",null,null,"2015-11-01","120.0618.4540.1","Pinka","@MELCHIOR","3te IV Rotigen 19"]
[4,"Vampir",null,"Bayard Medard & Gustav","N'Gampel",null,null,"2015-10-01","120.0618.4536.4","Violette","@MELCHIOR"]
{"$rows_left_out":151}
{"sheet":"2021","index":6,"n_rows":138,"n_cols":13,"rows_kept":138,"cut":false,"hidden":false,"merged":[]}
["Alpe Rotigen Turtmanntal"]
[]
["Alpaufzug vom 19. Juni 2021"]
[]
[null,null,null,"Trupposiegerin",124,null,null,"Tiere",null,null,"Klassiert 2020 und nicht da"]
[]
[null,null,null,"Klassiert 2020",25,null,"IV","Erstmelken",null,null,"Flacari, Bregy Ralf und Adolf (7em)"]
[]
[null,null,null,null,36,null,"N","Neu (Nicht da 2020)"]
[]
["Nr.","Name",null,"Besitzer","Ort",null,null,"Geb.","BDTA","Mutter","Vater","Klassierungen Alpe","Klassierungen Match"]
[1,"Venus",null,"Bayard Medard & Gustav","N'Gampel",null,null,"2014-11-01","120.0618.4532.6","Violette","@MAC"]
[2,"Fantastic",null,"Bayard Medard & Gustav","N'Gampel",null,null,"2015-12-01","120.1201.9792.2","Chinook","#CAPO","4te IV Rotigen 19"]
[3,"Priska",null,"Bayard Medard & Gustav","N'Gampel",null,null,"2015-11-01","120.0618.4540.1","Pinka","@MELCHIOR","3te IV Rotigen 19"]
[4,"Vampir",null,"Bayard Medard & Gustav","N'Gampel",null,null,"2015-10-01","120.0618.4536.4","Violette","@MELCHIOR"]
{"$rows_left_out":124}
{"sheet":"2020","index":7,"n_rows":143,"n_cols":12,"rows_kept":143,"cut":false,"hidden":false,"merged":[]}
[]
[null,"Alpe Rotigen Turtmanntal"]
[]
[null,null,null,"Alpaufzug vom 13. Juni 2020"]
[]
[]
[null,null,"Königin 2018 + 2019",116,null,null,"Tiere",null,null,null,"Klassiert 2019 und nicht da"]
[]
[null,null,"Trupposiegerin",26,null,"IV","Erstmelken",null,null,null,"Tigres von Fam. Leiggener (9em)"]
[null,null,null,null,null,null,null,null,null,null,"Puma von Zumofen/Gattlen (10em)"]
[null,null,"Klassiert 2019",2,null,"N","Neu (Nicht da 2019)",null,null,null,"Santiago von Bregy Ralf + Adolf (14em)"]
[]
[]
["Nr.","Name","Besitzer","Ort",null,null,"Geb.","BDTA","Mutter","Vater","Klassierungen Alpe","Klassierungen Match"]
[]
{"$rows_left_out":129}
{"sheet":"2019","index":8,"n_rows":131,"n_cols":12,"rows_kept":131,"cut":false,"hidden":false,"merged":[]}
[]
[null,"Alpe Rotigen Turtmanntal"]
[]
[null,null,null,"Alpaufzug vom 15. Juni 2019"]
[]
[]
[null,null,"Königin 2018",113,null,null,"Tiere",null,null,null,"Klassiert 2018 und nicht da"]
[null,null,null,22,null,"IV","Erstmelken",null,null,null,"Tango von Gebr. Jäger (9em)"]
[null,null,"Trupposiegerin",38,null,"N","Neu (Nicht da 2018)",null,null,null,"Rambo von Familie Leiggener (15em)"]
[null,null,null,51,null,null,"Glocken an Ringkuhkämpfen (Insgesamt)"]
[null,null,"Klassiert 2018",37,null,null,"Klassierte Tiere an Ringkuhkämpfen"]
[]
[]
["Nr.","Name","Besitzer","Ort",null,null,"Geb.","BDTA","Mutter","Vater","Klassierungen Alpe","Klassierungen Match"]
[]
{"$rows_left_out":117}
{"sheet":"2018","index":9,"n_rows":119,"n_cols":7,"rows_kept":119,"cut":false,"hidden":false,"merged":[[4,0,4,6]]}
[]
[]
[]
[]
["Rot = Troupeau-Siegerin "]
["Nr.","Name","Ohrmarkennr.","Geburtsdat.","Vater","Mutter","Eigentümer"]
[1,"Diabolo","120.0898.9041.4","2011-11-01","@PARATI","Dragon","Bayard Medard + Gustav"]
[2,"Mirabelle","120.0998.9046.6","2012-10-01","MESSI","Merry","Bayard Medard + Gustav"]
[3,"Venus","120.0618.4532.6","2014-11-01","@MAC","Violette","Bayard Medard + Gustav"]
[4,"Ramona","120.0998.9034.3","2011-10-01","$VITUS","Riquita","Bayard Medard + Gustav"]
[5,"Pandera","120.0618.4534.0","2014-12-01","PRINZ","Pinka","Bayard Medard + Gustav"]
[6,"Simba","120.0618.4530.2","2014-10-01","$TOURBILLON","Mousse","Bayard Medard + Gustav"]
[7,"Canaille","120.0591.3322.0","2012-10-01","$BREONA","Chealsy","Bregy Ralf + Adolf"]
[8,"Creola","120.0935.2375.9","2011-10-01","$BREONA","Dorina","Bregy Ralf + Adolf"]
[9,"Flacari","120.0931.3303.3","2010-11-01","@CARIBOU","Flash","Bregy Ralf + Adolf"]
{"$rows_left_out":104}