{"text_format":"1","workbook":"xlsx","n_sheets":10,"sheets":["Kämpfe","2026","2025","2024","2023","2022","2021","2020","2019","2018"],"not_rendered":{"charts":0,"images":1,"macros":1,"external_links":0,"defined_names":11,"comments":0,"pivot_tables":0},"unopened":[],"bounds":{"document_bytes":16777216,"sheet_cells":100000,"rows_first":2000,"rows_last":500,"rows_between":2000,"halvings":0,"cell_chars":16384,"cell_head_chars":4096},"cells_cut":0,"cells_raw":0,"read":"whole","date_system":"1900"}

{"sheet":"Kämpfe","index":0,"n_rows":727,"n_cols":12,"rows_kept":727,"cut":false,"hidden":false,"merged":[[1,1,1,3],[1,4,1,6]]}
[null,null,null,null,null,null,null,null,"Kuh Nr.",null,"Anzahl Kämpfe","Gewonnen"]
[null,"Gewinner",null,null,"Verlierer",null,null,null,null,null,{"$f":"COUNTIFS($D$4:$E$3323,$I$2)","v":0},{"$f":"COUNTIFS($D$4:$D$3323,$I$2)","v":0}]
["Datum","Besitzer","Name","Nr.","Nr.2","Name2","Besitzer2"]
["2026-07-19",{"$f":"IF(ISBLANK(D4),\"Alain, nix drischribu\",VLOOKUP(D4,'2026'!$A$16:$G$161,3,FALSE))","v":"Williner Anton"},{"$f":"VLOOKUP(D4,'2026'!$A$16:$B$161,2,FALSE)","v":"Venus"},76,9,{"$f":"VLOOKUP(E4,'2026'!$A$16:$G$161,2,FALSE)","v":"Banja"},{"$f":"IF(ISBLANK(E4),\"hie eu nix drischribu\",VLOOKUP(E4,'2026'!$A$16:$G$161,3,FALSE))","v":"Bregy Alain"}]
["2026-07-19",{"$f":"IF(ISBLANK(D5),\"Alain, nix drischribu\",VLOOKUP(D5,'2026'!$A$16:$G$161,3,FALSE))","v":"Gebrüder Jäger"},{"$f":"VLOOKUP(D5,'2026'!$A$16:$B$161,2,FALSE)","v":"Soraya"},23,57,{"$f":"VLOOKUP(E5,'2026'!$A$16:$G$161,2,FALSE)","v":"Bogota"},{"$f":"IF(ISBLANK(E5),\"hie eu nix drischribu\",VLOOKUP(E5,'2026'!$A$16:$G$161,3,FALSE))","v":"Stallung Jäger & Tscherrig"}]
["2026-07-19",{"$f":"IF(ISBLANK(D6),\"Alain, nix drischribu\",VLOOKUP(D6,'2026'!$A$16:$G$161,3,FALSE))","v":"Bregy Uli, Lisi & Pascal"},{"$f":"VLOOKUP(D6,'2026'!$A$16:$B$161,2,FALSE)","v":"Samba"},14,75,{"$f":"VLOOKUP(E6,'2026'!$A$16:$G$161,2,FALSE)","v":"Baldrun"},{"$f":"IF(ISBLANK(E6),\"hie eu nix drischribu\",VLOOKUP(E6,'2026'!$A$16:$G$161,3,FALSE))","v":"Stallung Passeraub"}]
["2026-07-19",{"$f":"IF(ISBLANK(D7),\"Alain, nix drischribu\",VLOOKUP(D7,'2026'!$A$16:$G$161,3,FALSE))","v":"Zumofen / Gattlen"},{"$f":"VLOOKUP(D7,'2026'!$A$16:$B$161,2,FALSE)","v":"Vesuv"},84,19,{"$f":"VLOOKUP(E7,'2026'!$A$16:$G$161,2,FALSE)","v":"Colette"},{"$f":"IF(ISBLANK(E7),\"hie eu nix drischribu\",VLOOKUP(E7,'2026'!$A$16:$G$161,3,FALSE))","v":"Familie Leiggener"}]
["2026-07-19",{"$f":"IF(ISBLANK(D8),\"Alain, nix drischribu\",VLOOKUP(D8,'2026'!$A$16:$G$161,3,FALSE))","v":"Gebrüder Jäger"},{"$f":"VLOOKUP(D8,'2026'!$A$16:$B$161,2,FALSE)","v":"Luna"},28,40,{"$f":"VLOOKUP(E8,'2026'!$A$16:$G$161,2,FALSE)","v":"Pandora"},{"$f":"IF(ISBLANK(E8),\"hie eu nix drischribu\",VLOOKUP(E8,'2026'!$A$16:$G$161,3,FALSE))","v":"Lötscher Sandrine & Cédric"}]
["2026-07-19",{"$f":"IF(ISBLANK(D9),\"Alain, nix drischribu\",VLOOKUP(D9,'2026'!$A$16:$G$161,3,FALSE))","v":"Stallung Passeraub"},{"$f":"VLOOKUP(D9,'2026'!$A$16:$B$161,2,FALSE)","v":"Bandera"},69,20,{"$f":"VLOOKUP(E9,'2026'!$A$16:$G$161,2,FALSE)","v":"Tirana"},{"$f":"IF(ISBLANK(E9),\"hie eu nix drischribu\",VLOOKUP(E9,'2026'!$A$16:$G$161,3,FALSE))","v":"Familie Leiggener"}]
["2026-07-19",{"$f":"IF(ISBLANK(D10),\"Alain, nix drischribu\",VLOOKUP(D10,'2026'!$A$16:$G$161,3,FALSE))","v":"Zumofen / Gattlen"},{"$f":"VLOOKUP(D10,'2026'!$A$16:$B$161,2,FALSE)","v":"Fame"},87,63,{"$f":"VLOOKUP(E10,'2026'!$A$16:$G$161,2,FALSE)","v":"Mistral"},{"$f":"IF(ISBLANK(E10),\"hie eu nix drischribu\",VLOOKUP(E10,'2026'!$A$16:$G$161,3,FALSE))","v":"Stallung Mussmann"}]
["2026-07-19",{"$f":"IF(ISBLANK(D11),\"Alain, nix drischribu\",VLOOKUP(D11,'2026'!$A$16:$G$161,3,FALSE))","v":"Hischier H. & Bühlmann J."},{"$f":"VLOOKUP(D11,'2026'!$A$16:$B$161,2,FALSE)","v":"Tara"},44,36,{"$f":"VLOOKUP(E11,'2026'!$A$16:$G$161,2,FALSE)","v":"Perle"},{"$f":"IF(ISBLANK(E11),\"hie eu nix drischribu\",VLOOKUP(E11,'2026'!$A$16:$G$161,3,FALSE))","v":"Lötscher Sandrine & Cédric"}]
["2026-07-19",{"$f":"IF(ISBLANK(D12),\"Alain, nix drischribu\",VLOOKUP(D12,'2026'!$A$16:$G$161,3,FALSE))","v":"Zumofen / Gattlen"},{"$f":"VLOOKUP(D12,'2026'!$A$16:$B$161,2,FALSE)","v":"Calcuta"},90,13,{"$f":"VLOOKUP(E12,'2026'!$A$16:$G$161,2,FALSE)","v":"Cora"},{"$f":"IF(ISBLANK(E12),\"hie eu nix drischribu\",VLOOKUP(E12,'2026'!$A$16:$G$161,3,FALSE))","v":"Bregy Uli, Lisi & Pascal"}]
["2026-07-19",{"$f":"IF(ISBLANK(D13),\"Alain, nix drischribu\",VLOOKUP(D13,'2026'!$A$16:$G$161,3,FALSE))","v":"Zumofen / Gattlen"},{"$f":"VLOOKUP(D13,'2026'!$A$16:$B$161,2,FALSE)","v":"Rigolo"},83,86,{"$f":"VLOOKUP(E13,'2026'!$A$16:$G$161,2,FALSE)","v":"Roquette"},{"$f":"IF(ISBLANK(E13),\"hie eu nix drischribu\",VLOOKUP(E13,'2026'!$A$16:$G$161,3,FALSE))","v":"Zumofen / Gattlen"}]
["2026-07-19",{"$f":"IF(ISBLANK(D14),\"Alain, nix drischribu\",VLOOKUP(D14,'2026'!$A$16:$G$161,3,FALSE))","v":"Familie Leiggener"},{"$f":"VLOOKUP(D14,'2026'!$A$16:$B$161,2,FALSE)","v":"Colette"},19,76,{"$f":"VLOOKUP(E14,'2026'!$A$16:$G$161,2,FALSE)","v":"Venus"},{"$f":"IF(ISBLANK(E14),\"hie eu nix drischribu\",VLOOKUP(E14,'2026'!$A$16:$G$161,3,FALSE))","v":"Williner Anton"}]
["2026-07-19",{"$f":"IF(ISBLANK(D15),\"Alain, nix drischribu\",VLOOKUP(D15,'2026'!$A$16:$G$161,3,FALSE))","v":"Stallung Jäger & Tscherrig"},{"$f":"VLOOKUP(D15,'2026'!$A$16:$B$161,2,FALSE)","v":"Myla"},55,3,{"$f":"VLOOKUP(E15,'2026'!$A$16:$G$161,2,FALSE)","v":"Pegasus"},{"$f":"IF(ISBLANK(E15),\"hie eu nix drischribu\",VLOOKUP(E15,'2026'!$A$16:$G$161,3,FALSE))","v":"Bayard Medard & Gustav"}]
["2026-07-19",{"$f":"IF(ISBLANK(D16),\"Alain, nix drischribu\",VLOOKUP(D16,'2026'!$A$16:$G$161,3,FALSE))","v":"Stallung Jäger & Tscherrig"},{"$f":"VLOOKUP(D16,'2026'!$A$16:$B$161,2,FALSE)","v":"Pinga"},54,89,{"$f":"VLOOKUP(E16,'2026'!$A$16:$G$161,2,FALSE)","v":"Verygood"},{"$f":"IF(ISBLANK(E16),\"hie eu nix drischribu\",VLOOKUP(E16,'2026'!$A$16:$G$161,3,FALSE))","v":"Zumofen / Gattlen"}]
["2026-07-19",{"$f":"IF(ISBLANK(D17),\"Alain, nix drischribu\",VLOOKUP(D17,'2026'!$A$16:$G$161,3,FALSE))","v":"Stallung Passeraub"},{"$f":"VLOOKUP(D17,'2026'!$A$16:$B$161,2,FALSE)","v":"Belana"},65,85,{"$f":"VLOOKUP(E17,'2026'!$A$16:$G$161,2,FALSE)","v":"Xea"},{"$f":"IF(ISBLANK(E17),\"hie eu nix drischribu\",VLOOKUP(E17,'2026'!$A$16:$G$161,3,FALSE))","v":"Zumofen / Gattlen"}]
["2026-07-19",{"$f":"IF(ISBLANK(D18),\"Alain, nix drischribu\",VLOOKUP(D18,'2026'!$A$16:$G$161,3,FALSE))","v":"Stallung Jäger & Tscherrig"},{"$f":"VLOOKUP(D18,'2026'!$A$16:$B$161,2,FALSE)","v":"Puma"},61,87,{"$f":"VLOOKUP(E18,'2026'!$A$16:$G$161,2,FALSE)","v":"Fame"},{"$f":"IF(ISBLANK(E18),\"hie eu nix drischribu\",VLOOKUP(E18,'2026'!$A$16:$G$161,3,FALSE))","v":"Zumofen / Gattlen"}]
["2026-07-18",{"$f":"IF(ISBLANK(D19),\"Alain, nix drischribu\",VLOOKUP(D19,'2026'!$A$16:$G$161,3,FALSE))","v":"Zumofen / Gattlen"},{"$f":"VLOOKUP(D19,'2026'!$A$16:$B$161,2,FALSE)","v":"Rigolo"},83,19,{"$f":"VLOOKUP(E19,'2026'!$A$16:$G$161,2,FALSE)","v":"Colette"},{"$f":"IF(ISBLANK(E19),\"hie eu nix drischribu\",VLOOKUP(E19,'2026'!$A$16:$G$161,3,FALSE))","v":"Familie Leiggener"}]
["2026-07-18",{"$f":"IF(ISBLANK(D20),\"Alain, nix drischribu\",VLOOKUP(D20,'2026'!$A$16:$G$161,3,FALSE))","v":"Familie Leiggener"},{"$f":"VLOOKUP(D20,'2026'!$A$16:$B$161,2,FALSE)","v":"Tirana"},20,8,{"$f":"VLOOKUP(E20,'2026'!$A$16:$G$161,2,FALSE)","v":"Valesia"},{"$f":"IF(ISBLANK(E20),\"hie eu nix drischribu\",VLOOKUP(E20,'2026'!$A$16:$G$161,3,FALSE))","v":"Bregy Alain"}]
["2026-07-18",{"$f":"IF(ISBLANK(D21),\"Alain, nix drischribu\",VLOOKUP(D21,'2026'!$A$16:$G$161,3,FALSE))","v":"Lötscher Sandrine & Cédric"},{"$f":"VLOOKUP(D21,'2026'!$A$16:$B$161,2,FALSE)","v":"Mesquine"},34,15,{"$f":"VLOOKUP(E21,'2026'!$A$16:$G$161,2,FALSE)","v":"Souma"},{"$f":"IF(ISBLANK(E21),\"hie eu nix drischribu\",VLOOKUP(E21,'2026'!$A$16:$G$161,3,FALSE))","v":"Bregy Uli, Lisi & Pascal"}]
["2026-07-18",{"$f":"IF(ISBLANK(D22),\"Alain, nix drischribu\",VLOOKUP(D22,'2026'!$A$16:$G$161,3,FALSE))","v":"Zumofen / Gattlen"},{"$f":"VLOOKUP(D22,'2026'!$A$16:$B$161,2,FALSE)","v":"Vergara"},91,90,{"$f":"VLOOKUP(E22,'2026'!$A$16:$G$161,2,FALSE)","v":"Calcuta"},{"$f":"IF(ISBLANK(E22),\"hie eu nix drischribu\",VLOOKUP(E22,'2026'!$A$16:$G$161,3,FALSE))","v":"Zumofen / Gattlen"}]
["2026-07-18",{"$f":"IF(ISBLANK(D23),\"Alain, nix drischribu\",VLOOKUP(D23,'2026'!$A$16:$G$161,3,FALSE))","v":"Williner Anton"},{"$f":"VLOOKUP(D23,'2026'!$A$16:$B$161,2,FALSE)","v":"Venus"},76,19,{"$f":"VLOOKUP(E23,'2026'!$A$16:$G$161,2,FALSE)","v":"Colette"},{"$f":"IF(ISBLANK(E23),\"hie eu nix drischribu\",VLOOKUP(E23,'2026'!$A$16:$G$161,3,FALSE))","v":"Familie Leiggener"}]
["2026-07-18",{"$f":"IF(ISBLANK(D24),\"Alain, nix drischribu\",VLOOKUP(D24,'2026'!$A$16:$G$161,3,FALSE))","v":"Williner Anton"},{"$f":"VLOOKUP(D24,'2026'!$A$16:$B$161,2,FALSE)","v":"Venus"},76,7,{"$f":"VLOOKUP(E24,'2026'!$A$16:$G$161,2,FALSE)","v":"Bilbao"},{"$f":"IF(ISBLANK(E24),\"hie eu nix drischribu\",VLOOKUP(E24,'2026'!$A$16:$G$161,3,FALSE))","v":"Bregy Alain"}]
["2026-07-18",{"$f":"IF(ISBLANK(D25),\"Alain, nix drischribu\",VLOOKUP(D25,'2026'!$A$16:$G$161,3,FALSE))","v":"Familie Leiggener"},{"$f":"VLOOKUP(D25,'2026'!$A$16:$B$161,2,FALSE)","v":"Tyson"},22,20,{"$f":"VLOOKUP(E25,'2026'!$A$16:$G$161,2,FALSE)","v":"Tirana"},{"$f":"IF(ISBLANK(E25),\"hie eu nix drischribu\",VLOOKUP(E25,'2026'!$A$16:$G$161,3,FALSE))","v":"Familie Leiggener"}]
["2026-07-18",{"$f":"IF(ISBLANK(D26),\"Alain, nix drischribu\",VLOOKUP(D26,'2026'!$A$16:$G$161,3,FALSE))","v":"Williner Anton"},{"$f":"VLOOKUP(D26,'2026'!$A$16:$B$161,2,FALSE)","v":"Dorin"},79,47,{"$f":"VLOOKUP(E26,'2026'!$A$16:$G$161,2,FALSE)","v":"Ramona"},{"$f":"IF(ISBLANK(E26),\"hie eu nix drischribu\",VLOOKUP(E26,'2026'!$A$16:$G$161,3,FALSE))","v":"Lauber Noah & Jonas"}]
["2026-07-18",{"$f":"IF(ISBLANK(D27),\"Alain, nix drischribu\",VLOOKUP(D27,'2026'!$A$16:$G$161,3,FALSE))","v":"Stallung Jäger & Tscherrig"},{"$f":"VLOOKUP(D27,'2026'!$A$16:$B$161,2,FALSE)","v":"Santana"},52,67,{"$f":"VLOOKUP(E27,'2026'!$A$16:$G$161,2,FALSE)","v":"Boriana"},{"$f":"IF(ISBLANK(E27),\"hie eu nix drischribu\",VLOOKUP(E27,'2026'!$A$16:$G$161,3,FALSE))","v":"Stallung Passeraub"}]
["2026-07-18",{"$f":"IF(ISBLANK(D28),\"Alain, nix drischribu\",VLOOKUP(D28,'2026'!$A$16:$G$161,3,FALSE))","v":"Bregy Uli, Lisi & Pascal"},{"$f":"VLOOKUP(D28,'2026'!$A$16:$B$161,2,FALSE)","v":"Panja"},17,46,{"$f":"VLOOKUP(E28,'2026'!$A$16:$G$161,2,FALSE)","v":"Cherico"},{"$f":"IF(ISBLANK(E28),\"hie eu nix drischribu\",VLOOKUP(E28,'2026'!$A$16:$G$161,3,FALSE))","v":"Lauber Noah & Jonas"}]
["2026-07-18",{"$f":"IF(ISBLANK(D29),\"Alain, nix drischribu\",VLOOKUP(D29,'2026'!$A$16:$G$161,3,FALSE))","v":"Hischier H. & Bühlmann J."},{"$f":"VLOOKUP(D29,'2026'!$A$16:$B$161,2,FALSE)","v":"Baghira"},43,71,{"$f":"VLOOKUP(E29,'2026'!$A$16:$G$161,2,FALSE)","v":"Fiona"},{"$f":"IF(ISBLANK(E29),\"hie eu nix drischribu\",VLOOKUP(E29,'2026'!$A$16:$G$161,3,FALSE))","v":"Hutter Richard"}]
["2026-07-18",{"$f":"IF(ISBLANK(D30),\"Alain, nix drischribu\",VLOOKUP(D30,'2026'!$A$16:$G$161,3,FALSE))","v":"Stallung Jäger & Tscherrig"},{"$f":"VLOOKUP(D30,'2026'!$A$16:$B$161,2,FALSE)","v":"Santana"},52,6,{"$f":"VLOOKUP(E30,'2026'!$A$16:$G$161,2,FALSE)","v":"Cataille"},{"$f":"IF(ISBLANK(E30),\"hie eu nix drischribu\",VLOOKUP(E30,'2026'!$A$16:$G$161,3,FALSE))","v":"Bregy Alain"}]
["2026-07-18",{"$f":"IF(ISBLANK(D31),\"Alain, nix drischribu\",VLOOKUP(D31,'2026'!$A$16:$G$161,3,FALSE))","v":"Stallung Jäger & Tscherrig"},{"$f":"VLOOKUP(D31,'2026'!$A$16:$B$161,2,FALSE)","v":"Sina"},53,76,{"$f":"VLOOKUP(E31,'2026'!$A$16:$G$161,2,FALSE)","v":"Venus"},{"$f":"IF(ISBLANK(E31),\"hie eu nix drischribu\",VLOOKUP(E31,'2026'!$A$16:$G$161,3,FALSE))","v":"Williner Anton"}]
["2026-07-18",{"$f":"IF(ISBLANK(D32),\"Alain, nix drischribu\",VLOOKUP(D32,'2026'!$A$16:$G$161,3,FALSE))","v":"Bregy Uli, Lisi & Pascal"},{"$f":"VLOOKUP(D32,'2026'!$A$16:$B$161,2,FALSE)","v":"Calina"},18,72,{"$f":"VLOOKUP(E32,'2026'!$A$16:$G$161,2,FALSE)","v":"Poseidon"},{"$f":"IF(ISBLANK(E32),\"hie eu nix drischribu\",VLOOKUP(E32,'2026'!$A$16:$G$161,3,FALSE))","v":"Hutter Richard"}]
["2026-07-18",{"$f":"IF(ISBLANK(D33),\"Alain, nix drischribu\",VLOOKUP(D33,'2026'!$A$16:$G$161,3,FALSE))","v":"Familie Leiggener"},{"$f":"VLOOKUP(D33,'2026'!$A$16:$B$161,2,FALSE)","v":"Tyson"},22,69,{"$f":"VLOOKUP(E33,'2026'!$A$16:$G$161,2,FALSE)","v":"Bandera"},{"$f":"IF(ISBLANK(E33),\"hie eu nix drischribu\",VLOOKUP(E33,'2026'!$A$16:$G$161,3,FALSE))","v":"Stallung Passeraub"}]
["2026-07-17",{"$f":"IF(ISBLANK(D34),\"Alain, nix drischribu\",VLOOKUP(D34,'2026'!$A$16:$G$161,3,FALSE))","v":"Williner Anton"},{"$f":"VLOOKUP(D34,'2026'!$A$16:$B$161,2,FALSE)","v":"Timba"},78,25,{"$f":"VLOOKUP(E34,'2026'!$A$16:$G$161,2,FALSE)","v":"Tirana"},{"$f":"IF(ISBLANK(E34),\"hie eu nix drischribu\",VLOOKUP(E34,'2026'!$A$16:$G$161,3,FALSE))","v":"Gebrüder Jäger"}]
["2026-07-17",{"$f":"IF(ISBLANK(D35),\"Alain, nix drischribu\",VLOOKUP(D35,'2026'!$A$16:$G$161,3,FALSE))","v":"Stallung Passeraub"},{"$f":"VLOOKUP(D35,'2026'!$A$16:$B$161,2,FALSE)","v":"Bonita"},64,78,{"$f":"VLOOKUP(E35,'2026'!$A$16:$G$161,2,FALSE)","v":"Timba"},{"$f":"IF(ISBLANK(E35),\"hie eu nix drischribu\",VLOOKUP(E35,'2026'!$A$16:$G$161,3,FALSE))","v":"Williner Anton"}]
["2026-07-17",{"$f":"IF(ISBLANK(D36),\"Alain, nix drischribu\",VLOOKUP(D36,'2026'!$A$16:$G$161,3,FALSE))","v":"Stallung Jäger & Tscherrig"},{"$f":"VLOOKUP(D36,'2026'!$A$16:$B$161,2,FALSE)","v":"Beline"},50,65,{"$f":"VLOOKUP(E36,'2026'!$A$16:$G$161,2,FALSE)","v":"Belana"},{"$f":"IF(ISBLANK(E36),\"hie eu nix drischribu\",VLOOKUP(E36,'2026'!$A$16:$G$161,3,FALSE))","v":"Stallung Passeraub"}]
["2026-07-17",{"$f":"IF(ISBLANK(D37),\"Alain, nix drischribu\",VLOOKUP(D37,'2026'!$A$16:$G$161,3,FALSE))","v":"Stallung Jäger & Tscherrig"},{"$f":"VLOOKUP(D37,'2026'!$A$16:$B$161,2,FALSE)","v":"Santana"},52,2,{"$f":"VLOOKUP(E37,'2026'!$A$16:$G$161,2,FALSE)","v":"Mamba"},{"$f":"IF(ISBLANK(E37),\"hie eu nix drischribu\",VLOOKUP(E37,'2026'!$A$16:$G$161,3,FALSE))","v":"Bayard Medard & Gustav"}]
["2026-07-17",{"$f":"IF(ISBLANK(D38),\"Alain, nix drischribu\",VLOOKUP(D38,'2026'!$A$16:$G$161,3,FALSE))","v":"Stallung Jäger & Tscherrig"},{"$f":"VLOOKUP(D38,'2026'!$A$16:$B$161,2,FALSE)","v":"Metis"},48,80,{"$f":"VLOOKUP(E38,'2026'!$A$16:$G$161,2,FALSE)","v":"Xena"},{"$f":"IF(ISBLANK(E38),\"hie eu nix drischribu\",VLOOKUP(E38,'2026'!$A$16:$G$161,3,FALSE))","v":"Zumofen / Gattlen"}]
["2026-07-17",{"$f":"IF(ISBLANK(D39),\"Alain, nix drischribu\",VLOOKUP(D39,'2026'!$A$16:$G$161,3,FALSE))","v":"Gebrüder Jäger"},{"$f":"VLOOKUP(D39,'2026'!$A$16:$B$161,2,FALSE)","v":"Tirana"},25,6,{"$f":"VLOOKUP(E39,'2026'!$A$16:$G$161,2,FALSE)","v":"Cataille"},{"$f":"IF(ISBLANK(E39),\"hie eu nix drischribu\",VLOOKUP(E39,'2026'!$A$16:$G$161,3,FALSE))","v":"Bregy Alain"}]
["2026-07-17",{"$f":"IF(ISBLANK(D40),\"Alain, nix drischribu\",VLOOKUP(D40,'2026'!$A$16:$G$161,3,FALSE))","v":"Stallung Jäger & Tscherrig"},{"$f":"VLOOKUP(D40,'2026'!$A$16:$B$161,2,FALSE)","v":"Samba"},49,81,{"$f":"VLOOKUP(E40,'2026'!$A$16:$G$161,2,FALSE)","v":"Souris"},{"$f":"IF(ISBLANK(E40),\"hie eu nix drischribu\",VLOOKUP(E40,'2026'!$A$16:$G$161,3,FALSE))","v":"Zumofen / Gattlen"}]
["2026-07-17",{"$f":"IF(ISBLANK(D41),\"Alain, nix drischribu\",VLOOKUP(D41,'2026'!$A$16:$G$161,3,FALSE))","v":"Zumofen / Gattlen"},{"$f":"VLOOKUP(D41,'2026'!$A$16:$B$161,2,FALSE)","v":"Vergara"},91,2,{"$f":"VLOOKUP(E41,'2026'!$A$16:$G$161,2,FALSE)","v":"Mamba"},{"$f":"IF(ISBLANK(E41),\"hie eu nix drischribu\",VLOOKUP(E41,'2026'!$A$16:$G$161,3,FALSE))","v":"Bayard Medard & Gustav"}]
["2026-07-17",{"$f":"IF(ISBLANK(D42),\"Alain, nix drischribu\",VLOOKUP(D42,'2026'!$A$16:$G$161,3,FALSE))","v":"Bayard Medard & Gustav"},{"$f":"VLOOKUP(D42,'2026'!$A$16:$B$161,2,FALSE)","v":"Mamba"},2,77,{"$f":"VLOOKUP(E42,'2026'!$A$16:$G$161,2,FALSE)","v":"Tirana"},{"$f":"IF(ISBLANK(E42),\"hie eu nix drischribu\",VLOOKUP(E42,'2026'!$A$16:$G$161,3,FALSE))","v":"Williner Anton"}]
["2026-07-17",{"$f":"IF(ISBLANK(D43),\"Alain, nix drischribu\",VLOOKUP(D43,'2026'!$A$16:$G$161,3,FALSE))","v":"Lötscher Sandrine & Cédric"},{"$f":"VLOOKUP(D43,'2026'!$A$16:$B$161,2,FALSE)","v":"Pandora"},40,32,{"$f":"VLOOKUP(E43,'2026'!$A$16:$G$161,2,FALSE)","v":"Ceres"},{"$f":"IF(ISBLANK(E43),\"hie eu nix drischribu\",VLOOKUP(E43,'2026'!$A$16:$G$161,3,FALSE))","v":"Geschwister Lötscher"}]
["2026-07-16",{"$f":"IF(ISBLANK(D44),\"Alain, nix drischribu\",VLOOKUP(D44,'2026'!$A$16:$G$161,3,FALSE))","v":"Stallung Passeraub"},{"$f":"VLOOKUP(D44,'2026'!$A$16:$B$161,2,FALSE)","v":"Malice"},73,23,{"$f":"VLOOKUP(E44,'2026'!$A$16:$G$161,2,FALSE)","v":"Soraya"},{"$f":"IF(ISBLANK(E44),\"hie eu nix drischribu\",VLOOKUP(E44,'2026'!$A$16:$G$161,3,FALSE))","v":"Gebrüder Jäger"}]
["2026-07-16",{"$f":"IF(ISBLANK(D45),\"Alain, nix drischribu\",VLOOKUP(D45,'2026'!$A$16:$G$161,3,FALSE))","v":"Familie Leiggener"},{"$f":"VLOOKUP(D45,'2026'!$A$16:$B$161,2,FALSE)","v":"Colette"},19,91,{"$f":"VLOOKUP(E45,'2026'!$A$16:$G$161,2,FALSE)","v":"Vergara"},{"$f":"IF(ISBLANK(E45),\"hie eu nix drischribu\",VLOOKUP(E45,'2026'!$A$16:$G$161,3,FALSE))","v":"Zumofen / Gattlen"}]
["2026-07-16",{"$f":"IF(ISBLANK(D46),\"Alain, nix drischribu\",VLOOKUP(D46,'2026'!$A$16:$G$161,3,FALSE))","v":"Stallung Passeraub"},{"$f":"VLOOKUP(D46,'2026'!$A$16:$B$161,2,FALSE)","v":"Malice"},73,60,{"$f":"VLOOKUP(E46,'2026'!$A$16:$G$161,2,FALSE)","v":"Samoa"},{"$f":"IF(ISBLANK(E46),\"hie eu nix drischribu\",VLOOKUP(E46,'2026'!$A$16:$G$161,3,FALSE))","v":"Stallung Jäger & Tscherrig"}]
["2026-07-16",{"$f":"IF(ISBLANK(D47),\"Alain, nix drischribu\",VLOOKUP(D47,'2026'!$A$16:$G$161,3,FALSE))","v":"Hischier H. & Bühlmann J."},{"$f":"VLOOKUP(D47,'2026'!$A$16:$B$161,2,FALSE)","v":"Baghira"},43,15,{"$f":"VLOOKUP(E47,'2026'!$A$16:$G$161,2,FALSE)","v":"Souma"},{"$f":"IF(ISBLANK(E47),\"hie eu nix drischribu\",VLOOKUP(E47,'2026'!$A$16:$G$161,3,FALSE))","v":"Bregy Uli, Lisi & Pascal"}]
["2026-07-16",{"$f":"IF(ISBLANK(D48),\"Alain, nix drischribu\",VLOOKUP(D48,'2026'!$A$16:$G$161,3,FALSE))","v":"Zumofen / Gattlen"},{"$f":"VLOOKUP(D48,'2026'!$A$16:$B$161,2,FALSE)","v":"Xea"},85,84,{"$f":"VLOOKUP(E48,'2026'!$A$16:$G$161,2,FALSE)","v":"Vesuv"},{"$f":"IF(ISBLANK(E48),\"hie eu nix drischribu\",VLOOKUP(E48,'2026'!$A$16:$G$161,3,FALSE))","v":"Zumofen / Gattlen"}]
["2026-07-16",{"$f":"IF(ISBLANK(D49),\"Alain, nix drischribu\",VLOOKUP(D49,'2026'!$A$16:$G$161,3,FALSE))","v":"Zumofen / Gattlen"},{"$f":"VLOOKUP(D49,'2026'!$A$16:$B$161,2,FALSE)","v":"Vesuv"},84,88,{"$f":"VLOOKUP(E49,'2026'!$A$16:$G$161,2,FALSE)","v":"Valdeeze"},{"$f":"IF(ISBLANK(E49),\"hie eu nix drischribu\",VLOOKUP(E49,'2026'!$A$16:$G$161,3,FALSE))","v":"Zumofen / Gattlen"}]
["2026-07-16",{"$f":"IF(ISBLANK(D50),\"Alain, nix drischribu\",VLOOKUP(D50,'2026'!$A$16:$G$161,3,FALSE))","v":"Bregy Uli, Lisi & Pascal"},{"$f":"VLOOKUP(D50,'2026'!$A$16:$B$161,2,FALSE)","v":"Perona"},10,60,{"$f":"VLOOKUP(E50,'2026'!$A$16:$G$161,2,FALSE)","v":"Samoa"},{"$f":"IF(ISBLANK(E50),\"hie eu nix drischribu\",VLOOKUP(E50,'2026'!$A$16:$G$161,3,FALSE))","v":"Stallung Jäger & Tscherrig"}]
["2026-07-16",{"$f":"IF(ISBLANK(D51),\"Alain, nix drischribu\",VLOOKUP(D51,'2026'!$A$16:$G$161,3,FALSE))","v":"Stallung Jäger & Tscherrig"},{"$f":"VLOOKUP(D51,'2026'!$A$16:$B$161,2,FALSE)","v":"Samoa"},60,70,{"$f":"VLOOKUP(E51,'2026'!$A$16:$G$161,2,FALSE)","v":"Belle"},{"$f":"IF(ISBLANK(E51),\"hie eu nix drischribu\",VLOOKUP(E51,'2026'!$A$16:$G$161,3,FALSE))","v":"Stallung Passeraub"}]
["2026-07-16",{"$f":"IF(ISBLANK(D52),\"Alain, nix drischribu\",VLOOKUP(D52,'2026'!$A$16:$G$161,3,FALSE))","v":"Stallung Passeraub"},{"$f":"VLOOKUP(D52,'2026'!$A$16:$B$161,2,FALSE)","v":"Belana"},65,50,{"$f":"VLOOKUP(E52,'2026'!$A$16:$G$161,2,FALSE)","v":"Beline"},{"$f":"IF(ISBLANK(E52),\"hie eu nix drischribu\",VLOOKUP(E52,'2026'!$A$16:$G$161,3,FALSE))","v":"Stallung Jäger & Tscherrig"}]
["2026-07-16",{"$f":"IF(ISBLANK(D53),\"Alain, nix drischribu\",VLOOKUP(D53,'2026'!$A$16:$G$161,3,FALSE))","v":"Stallung Jäger & Tscherrig"},{"$f":"VLOOKUP(D53,'2026'!$A$16:$B$161,2,FALSE)","v":"Bogota"},57,89,{"$f":"VLOOKUP(E53,'2026'!$A$16:$G$161,2,FALSE)","v":"Verygood"},{"$f":"IF(ISBLANK(E53),\"hie eu nix drischribu\",VLOOKUP(E53,'2026'!$A$16:$G$161,3,FALSE))","v":"Zumofen / Gattlen"}]
["2026-07-16",{"$f":"IF(ISBLANK(D54),\"Alain, nix drischribu\",VLOOKUP(D54,'2026'!$A$16:$G$161,3,FALSE))","v":"Zumofen / Gattlen"},{"$f":"VLOOKUP(D54,'2026'!$A$16:$B$161,2,FALSE)","v":"Verygood"},89,57,{"$f":"VLOOKUP(E54,'2026'!$A$16:$G$161,2,FALSE)","v":"Bogota"},{"$f":"IF(ISBLANK(E54),\"hie eu nix drischribu\",VLOOKUP(E54,'2026'!$A$16:$G$161,3,FALSE))","v":"Stallung Jäger & Tscherrig"}]
["2026-07-16",{"$f":"IF(ISBLANK(D55),\"Alain, nix drischribu\",VLOOKUP(D55,'2026'!$A$16:$G$161,3,FALSE))","v":"Bayard Medard & Gustav"},{"$f":"VLOOKUP(D55,'2026'!$A$16:$B$161,2,FALSE)","v":"Vampir"},4,60,{"$f":"VLOOKUP(E55,'2026'!$A$16:$G$161,2,FALSE)","v":"Samoa"},{"$f":"IF(ISBLANK(E55),\"hie eu nix drischribu\",VLOOKUP(E55,'2026'!$A$16:$G$161,3,FALSE))","v":"Stallung Jäger & Tscherrig"}]
["2026-07-16",{"$f":"IF(ISBLANK(D56),\"Alain, nix drischribu\",VLOOKUP(D56,'2026'!$A$16:$G$161,3,FALSE))","v":"Stallung Jäger & Tscherrig"},{"$f":"VLOOKUP(D56,'2026'!$A$16:$B$161,2,FALSE)","v":"Samoa"},60,3,{"$f":"VLOOKUP(E56,'2026'!$A$16:$G$161,2,FALSE)","v":"Pegasus"},{"$f":"IF(ISBLANK(E56),\"hie eu nix drischribu\",VLOOKUP(E56,'2026'!$A$16:$G$161,3,FALSE))","v":"Bayard Medard & Gustav"}]
["2026-07-15",{"$f":"IF(ISBLANK(D57),\"Alain, nix drischribu\",VLOOKUP(D57,'2026'!$A$16:$G$161,3,FALSE))","v":"Stallung Jäger & Tscherrig"},{"$f":"VLOOKUP(D57,'2026'!$A$16:$B$161,2,FALSE)","v":"Pinga"},54,19,{"$f":"VLOOKUP(E57,'2026'!$A$16:$G$161,2,FALSE)","v":"Colette"},{"$f":"IF(ISBLANK(E57),\"hie eu nix drischribu\",VLOOKUP(E57,'2026'!$A$16:$G$161,3,FALSE))","v":"Familie Leiggener"}]
["2026-07-15",{"$f":"IF(ISBLANK(D58),\"Alain, nix drischribu\",VLOOKUP(D58,'2026'!$A$16:$G$161,3,FALSE))","v":"Williner Anton"},{"$f":"VLOOKUP(D58,'2026'!$A$16:$B$161,2,FALSE)","v":"Venus"},76,6,{"$f":"VLOOKUP(E58,'2026'!$A$16:$G$161,2,FALSE)","v":"Cataille"},{"$f":"IF(ISBLANK(E58),\"hie eu nix drischribu\",VLOOKUP(E58,'2026'!$A$16:$G$161,3,FALSE))","v":"Bregy Alain"}]
["2026-07-15",{"$f":"IF(ISBLANK(D59),\"Alain, nix drischribu\",VLOOKUP(D59,'2026'!$A$16:$G$161,3,FALSE))","v":"Lauber Noah & Jonas"},{"$f":"VLOOKUP(D59,'2026'!$A$16:$B$161,2,FALSE)","v":"Cherico"},46,28,{"$f":"VLOOKUP(E59,'2026'!$A$16:$G$161,2,FALSE)","v":"Luna"},{"$f":"IF(ISBLANK(E59),\"hie eu nix drischribu\",VLOOKUP(E59,'2026'!$A$16:$G$161,3,FALSE))","v":"Gebrüder Jäger"}]
["2026-07-15",{"$f":"IF(ISBLANK(D60),\"Alain, nix drischribu\",VLOOKUP(D60,'2026'!$A$16:$G$161,3,FALSE))","v":"Lauber Noah & Jonas"},{"$f":"VLOOKUP(D60,'2026'!$A$16:$B$161,2,FALSE)","v":"Cherico"},46,30,{"$f":"VLOOKUP(E60,'2026'!$A$16:$G$161,2,FALSE)","v":"Tamango"},{"$f":"IF(ISBLANK(E60),\"hie eu nix drischribu\",VLOOKUP(E60,'2026'!$A$16:$G$161,3,FALSE))","v":"Gebrüder Jäger"}]
["2026-07-15",{"$f":"IF(ISBLANK(D61),\"Alain, nix drischribu\",VLOOKUP(D61,'2026'!$A$16:$G$161,3,FALSE))","v":"Zumofen / Gattlen"},{"$f":"VLOOKUP(D61,'2026'!$A$16:$B$161,2,FALSE)","v":"Vergara"},91,57,{"$f":"VLOOKUP(E61,'2026'!$A$16:$G$161,2,FALSE)","v":"Bogota"},{"$f":"IF(ISBLANK(E61),\"hie eu nix drischribu\",VLOOKUP(E61,'2026'!$A$16:$G$161,3,FALSE))","v":"Stallung Jäger & Tscherrig"}]
["2026-07-15",{"$f":"IF(ISBLANK(D62),\"Alain, nix drischribu\",VLOOKUP(D62,'2026'!$A$16:$G$161,3,FALSE))","v":"Stallung Jäger & Tscherrig"},{"$f":"VLOOKUP(D62,'2026'!$A$16:$B$161,2,FALSE)","v":"Bogota"},57,89,{"$f":"VLOOKUP(E62,'2026'!$A$16:$G$161,2,FALSE)","v":"Verygood"},{"$f":"IF(ISBLANK(E62),\"hie eu nix drischribu\",VLOOKUP(E62,'2026'!$A$16:$G$161,3,FALSE))","v":"Zumofen / Gattlen"}]
["2026-07-15",{"$f":"IF(ISBLANK(D63),\"Alain, nix drischribu\",VLOOKUP(D63,'2026'!$A$16:$G$161,3,FALSE))","v":"Williner Anton"},{"$f":"VLOOKUP(D63,'2026'!$A$16:$B$161,2,FALSE)","v":"Tirana"},77,53,{"$f":"VLOOKUP(E63,'2026'!$A$16:$G$161,2,FALSE)","v":"Sina"},{"$f":"IF(ISBLANK(E63),\"hie eu nix drischribu\",VLOOKUP(E63,'2026'!$A$16:$G$161,3,FALSE))","v":"Stallung Jäger & Tscherrig"}]
["2026-07-15",{"$f":"IF(ISBLANK(D64),\"Alain, nix drischribu\",VLOOKUP(D64,'2026'!$A$16:$G$161,3,FALSE))","v":"Bregy Alain"},{"$f":"VLOOKUP(D64,'2026'!$A$16:$B$161,2,FALSE)","v":"Cataille"},6,87,{"$f":"VLOOKUP(E64,'2026'!$A$16:$G$161,2,FALSE)","v":"Fame"},{"$f":"IF(ISBLANK(E64),\"hie eu nix drischribu\",VLOOKUP(E64,'2026'!$A$16:$G$161,3,FALSE))","v":"Zumofen / Gattlen"}]
["2026-07-15",{"$f":"IF(ISBLANK(D65),\"Alain, nix drischribu\",VLOOKUP(D65,'2026'!$A$16:$G$161,3,FALSE))","v":"Williner Anton"},{"$f":"VLOOKUP(D65,'2026'!$A$16:$B$161,2,FALSE)","v":"Tirana"},77,69,{"$f":"VLOOKUP(E65,'2026'!$A$16:$G$161,2,FALSE)","v":"Bandera"},{"$f":"IF(ISBLANK(E65),\"hie eu nix drischribu\",VLOOKUP(E65,'2026'!$A$16:$G$161,3,FALSE))","v":"Stallung Passeraub"}]
["2026-07-15",{"$f":"IF(ISBLANK(D66),\"Alain, nix drischribu\",VLOOKUP(D66,'2026'!$A$16:$G$161,3,FALSE))","v":"Gebrüder Jäger"},{"$f":"VLOOKUP(D66,'2026'!$A$16:$B$161,2,FALSE)","v":"Soraya"},23,63,{"$f":"VLOOKUP(E66,'2026'!$A$16:$G$161,2,FALSE)","v":"Mistral"},{"$f":"IF(ISBLANK(E66),\"hie eu nix drischribu\",VLOOKUP(E66,'2026'!$A$16:$G$161,3,FALSE))","v":"Stallung Mussmann"}]
["2026-07-14",{"$f":"IF(ISBLANK(D67),\"Alain, nix drischribu\",VLOOKUP(D67,'2026'!$A$16:$G$161,3,FALSE))","v":"Williner Anton"},{"$f":"VLOOKUP(D67,'2026'!$A$16:$B$161,2,FALSE)","v":"Timba"},78,7,{"$f":"VLOOKUP(E67,'2026'!$A$16:$G$161,2,FALSE)","v":"Bilbao"},{"$f":"IF(ISBLANK(E67),\"hie eu nix drischribu\",VLOOKUP(E67,'2026'!$A$16:$G$161,3,FALSE))","v":"Bregy Alain"}]
["2026-07-14",{"$f":"IF(ISBLANK(D68),\"Alain, nix drischribu\",VLOOKUP(D68,'2026'!$A$16:$G$161,3,FALSE))","v":"Hischier H. & Bühlmann J."},{"$f":"VLOOKUP(D68,'2026'!$A$16:$B$161,2,FALSE)","v":"Baghira"},43,72,{"$f":"VLOOKUP(E68,'2026'!$A$16:$G$161,2,FALSE)","v":"Poseidon"},{"$f":"IF(ISBLANK(E68),\"hie eu nix drischribu\",VLOOKUP(E68,'2026'!$A$16:$G$161,3,FALSE))","v":"Hutter Richard"}]
["2026-07-14",{"$f":"IF(ISBLANK(D69),\"Alain, nix drischribu\",VLOOKUP(D69,'2026'!$A$16:$G$161,3,FALSE))","v":"Zumofen / Gattlen"},{"$f":"VLOOKUP(D69,'2026'!$A$16:$B$161,2,FALSE)","v":"Vergara"},91,59,{"$f":"VLOOKUP(E69,'2026'!$A$16:$G$161,2,FALSE)","v":"Medusa"},{"$f":"IF(ISBLANK(E69),\"hie eu nix drischribu\",VLOOKUP(E69,'2026'!$A$16:$G$161,3,FALSE))","v":"Stallung Jäger & Tscherrig"}]
["2026-07-14",{"$f":"IF(ISBLANK(D70),\"Alain, nix drischribu\",VLOOKUP(D70,'2026'!$A$16:$G$161,3,FALSE))","v":"Stallung Passeraub"},{"$f":"VLOOKUP(D70,'2026'!$A$16:$B$161,2,FALSE)","v":"Bonita"},64,44,{"$f":"VLOOKUP(E70,'2026'!$A$16:$G$161,2,FALSE)","v":"Tara"},{"$f":"IF(ISBLANK(E70),\"hie eu nix drischribu\",VLOOKUP(E70,'2026'!$A$16:$G$161,3,FALSE))","v":"Hischier H. & Bühlmann J."}]
["2026-07-14",{"$f":"IF(ISBLANK(D71),\"Alain, nix drischribu\",VLOOKUP(D71,'2026'!$A$16:$G$161,3,FALSE))","v":"Bregy Uli, Lisi & Pascal"},{"$f":"VLOOKUP(D71,'2026'!$A$16:$B$161,2,FALSE)","v":"Cora"},13,55,{"$f":"VLOOKUP(E71,'2026'!$A$16:$G$161,2,FALSE)","v":"Myla"},{"$f":"IF(ISBLANK(E71),\"hie eu nix drischribu\",VLOOKUP(E71,'2026'!$A$16:$G$161,3,FALSE))","v":"Stallung Jäger & Tscherrig"}]
["2026-07-13",{"$f":"IF(ISBLANK(D72),\"Alain, nix drischribu\",VLOOKUP(D72,'2026'!$A$16:$G$161,3,FALSE))","v":"Stallung Jäger & Tscherrig"},{"$f":"VLOOKUP(D72,'2026'!$A$16:$B$161,2,FALSE)","v":"Pinga"},54,19,{"$f":"VLOOKUP(E72,'2026'!$A$16:$G$161,2,FALSE)","v":"Colette"},{"$f":"IF(ISBLANK(E72),\"hie eu nix drischribu\",VLOOKUP(E72,'2026'!$A$16:$G$161,3,FALSE))","v":"Familie Leiggener"}]
["2026-07-13",{"$f":"IF(ISBLANK(D73),\"Alain, nix drischribu\",VLOOKUP(D73,'2026'!$A$16:$G$161,3,FALSE))","v":"Familie Leiggener"},{"$f":"VLOOKUP(D73,'2026'!$A$16:$B$161,2,FALSE)","v":"Royale"},21,57,{"$f":"VLOOKUP(E73,'2026'!$A$16:$G$161,2,FALSE)","v":"Bogota"},{"$f":"IF(ISBLANK(E73),\"hie eu nix drischribu\",VLOOKUP(E73,'2026'!$A$16:$G$161,3,FALSE))","v":"Stallung Jäger & Tscherrig"}]
["2026-07-13",{"$f":"IF(ISBLANK(D74),\"Alain, nix drischribu\",VLOOKUP(D74,'2026'!$A$16:$G$161,3,FALSE))","v":"Stallung Passeraub"},{"$f":"VLOOKUP(D74,'2026'!$A$16:$B$161,2,FALSE)","v":"Belle"},70,10,{"$f":"VLOOKUP(E74,'2026'!$A$16:$G$161,2,FALSE)","v":"Perona"},{"$f":"IF(ISBLANK(E74),\"hie eu nix drischribu\",VLOOKUP(E74,'2026'!$A$16:$G$161,3,FALSE))","v":"Bregy Uli, Lisi & Pascal"}]
["2026-07-13",{"$f":"IF(ISBLANK(D75),\"Alain, nix drischribu\",VLOOKUP(D75,'2026'!$A$16:$G$161,3,FALSE))","v":"Stallung Passeraub"},{"$f":"VLOOKUP(D75,'2026'!$A$16:$B$161,2,FALSE)","v":"Belle"},70,12,{"$f":"VLOOKUP(E75,'2026'!$A$16:$G$161,2,FALSE)","v":"Cara"},{"$f":"IF(ISBLANK(E75),\"hie eu nix drischribu\",VLOOKUP(E75,'2026'!$A$16:$G$161,3,FALSE))","v":"Bregy Uli, Lisi & Pascal"}]
["2026-07-13",{"$f":"IF(ISBLANK(D76),\"Alain, nix drischribu\",VLOOKUP(D76,'2026'!$A$16:$G$161,3,FALSE))","v":"Hischier H. & Bühlmann J."},{"$f":"VLOOKUP(D76,'2026'!$A$16:$B$161,2,FALSE)","v":"Alena"},42,30,{"$f":"VLOOKUP(E76,'2026'!$A$16:$G$161,2,FALSE)","v":"Tamango"},{"$f":"IF(ISBLANK(E76),\"hie eu nix drischribu\",VLOOKUP(E76,'2026'!$A$16:$G$161,3,FALSE))","v":"Gebrüder Jäger"}]
["2026-07-13",{"$f":"IF(ISBLANK(D77),\"Alain, nix drischribu\",VLOOKUP(D77,'2026'!$A$16:$G$161,3,FALSE))","v":"Stallung Jäger & Tscherrig"},{"$f":"VLOOKUP(D77,'2026'!$A$16:$B$161,2,FALSE)","v":"Myla"},55,13,{"$f":"VLOOKUP(E77,'2026'!$A$16:$G$161,2,FALSE)","v":"Cora"},{"$f":"IF(ISBLANK(E77),\"hie eu nix drischribu\",VLOOKUP(E77,'2026'!$A$16:$G$161,3,FALSE))","v":"Bregy Uli, Lisi & Pascal"}]
["2026-07-13",{"$f":"IF(ISBLANK(D78),\"Alain, nix drischribu\",VLOOKUP(D78,'2026'!$A$16:$G$161,3,FALSE))","v":"Stallung Jäger & Tscherrig"},{"$f":"VLOOKUP(D78,'2026'!$A$16:$B$161,2,FALSE)","v":"Sina"},53,77,{"$f":"VLOOKUP(E78,'2026'!$A$16:$G$161,2,FALSE)","v":"Tirana"},{"$f":"IF(ISBLANK(E78),\"hie eu nix drischribu\",VLOOKUP(E78,'2026'!$A$16:$G$161,3,FALSE))","v":"Williner Anton"}]
["2026-07-13",{"$f":"IF(ISBLANK(D79),\"Alain, nix drischribu\",VLOOKUP(D79,'2026'!$A$16:$G$161,3,FALSE))","v":"Stallung Jäger & Tscherrig"},{"$f":"VLOOKUP(D79,'2026'!$A$16:$B$161,2,FALSE)","v":"Sina"},53,7,{"$f":"VLOOKUP(E79,'2026'!$A$16:$G$161,2,FALSE)","v":"Bilbao"},{"$f":"IF(ISBLANK(E79),\"hie eu nix drischribu\",VLOOKUP(E79,'2026'!$A$16:$G$161,3,FALSE))","v":"Bregy Alain"}]
["2026-07-13",{"$f":"IF(ISBLANK(D80),\"Alain, nix drischribu\",VLOOKUP(D80,'2026'!$A$16:$G$161,3,FALSE))","v":"Zumofen / Gattlen"},{"$f":"VLOOKUP(D80,'2026'!$A$16:$B$161,2,FALSE)","v":"Vergara"},91,18,{"$f":"VLOOKUP(E80,'2026'!$A$16:$G$161,2,FALSE)","v":"Calina"},{"$f":"IF(ISBLANK(E80),\"hie eu nix drischribu\",VLOOKUP(E80,'2026'!$A$16:$G$161,3,FALSE))","v":"Bregy Uli, Lisi & Pascal"}]
["2026-07-13",{"$f":"IF(ISBLANK(D81),\"Alain, nix drischribu\",VLOOKUP(D81,'2026'!$A$16:$G$161,3,FALSE))","v":"Zumofen / Gattlen"},{"$f":"VLOOKUP(D81,'2026'!$A$16:$B$161,2,FALSE)","v":"Vergara"},91,19,{"$f":"VLOOKUP(E81,'2026'!$A$16:$G$161,2,FALSE)","v":"Colette"},{"$f":"IF(ISBLANK(E81),\"hie eu nix drischribu\",VLOOKUP(E81,'2026'!$A$16:$G$161,3,FALSE))","v":"Familie Leiggener"}]
["2026-07-13",{"$f":"IF(ISBLANK(D82),\"Alain, nix drischribu\",VLOOKUP(D82,'2026'!$A$16:$G$161,3,FALSE))","v":"Stallung Passeraub"},{"$f":"VLOOKUP(D82,'2026'!$A$16:$B$161,2,FALSE)","v":"Bolienne"},68,6,{"$f":"VLOOKUP(E82,'2026'!$A$16:$G$161,2,FALSE)","v":"Cataille"},{"$f":"IF(ISBLANK(E82),\"hie eu nix drischribu\",VLOOKUP(E82,'2026'!$A$16:$G$161,3,FALSE))","v":"Bregy Alain"}]
["2026-07-12",{"$f":"IF(ISBLANK(D83),\"Alain, nix drischribu\",VLOOKUP(D83,'2026'!$A$16:$G$161,3,FALSE))","v":"Zumofen / Gattlen"},{"$f":"VLOOKUP(D83,'2026'!$A$16:$B$161,2,FALSE)","v":"Vergara"},91,56,{"$f":"VLOOKUP(E83,'2026'!$A$16:$G$161,2,FALSE)","v":"Fanny"},{"$f":"IF(ISBLANK(E83),\"hie eu nix drischribu\",VLOOKUP(E83,'2026'!$A$16:$G$161,3,FALSE))","v":"Stallung Jäger & Tscherrig"}]
["2026-07-12",{"$f":"IF(ISBLANK(D84),\"Alain, nix drischribu\",VLOOKUP(D84,'2026'!$A$16:$G$161,3,FALSE))","v":"Stallung Jäger & Tscherrig"},{"$f":"VLOOKUP(D84,'2026'!$A$16:$B$161,2,FALSE)","v":"Bogota"},57,89,{"$f":"VLOOKUP(E84,'2026'!$A$16:$G$161,2,FALSE)","v":"Verygood"},{"$f":"IF(ISBLANK(E84),\"hie eu nix drischribu\",VLOOKUP(E84,'2026'!$A$16:$G$161,3,FALSE))","v":"Zumofen / Gattlen"}]
["2026-07-12",{"$f":"IF(ISBLANK(D85),\"Alain, nix drischribu\",VLOOKUP(D85,'2026'!$A$16:$G$161,3,FALSE))","v":"Stallung Jäger & Tscherrig"},{"$f":"VLOOKUP(D85,'2026'!$A$16:$B$161,2,FALSE)","v":"Pixel"},58,71,{"$f":"VLOOKUP(E85,'2026'!$A$16:$G$161,2,FALSE)","v":"Fiona"},{"$f":"IF(ISBLANK(E85),\"hie eu nix drischribu\",VLOOKUP(E85,'2026'!$A$16:$G$161,3,FALSE))","v":"Hutter Richard"}]
["2026-07-12",{"$f":"IF(ISBLANK(D86),\"Alain, nix drischribu\",VLOOKUP(D86,'2026'!$A$16:$G$161,3,FALSE))","v":"Gebrüder Jäger"},{"$f":"VLOOKUP(D86,'2026'!$A$16:$B$161,2,FALSE)","v":"Luna"},28,74,{"$f":"VLOOKUP(E86,'2026'!$A$16:$G$161,2,FALSE)","v":"Brunette"},{"$f":"IF(ISBLANK(E86),\"hie eu nix drischribu\",VLOOKUP(E86,'2026'!$A$16:$G$161,3,FALSE))","v":"Stallung Passeraub"}]
["2026-07-12",{"$f":"IF(ISBLANK(D87),\"Alain, nix drischribu\",VLOOKUP(D87,'2026'!$A$16:$G$161,3,FALSE))","v":"Stallung Jäger & Tscherrig"},{"$f":"VLOOKUP(D87,'2026'!$A$16:$B$161,2,FALSE)","v":"Sina"},53,67,{"$f":"VLOOKUP(E87,'2026'!$A$16:$G$161,2,FALSE)","v":"Boriana"},{"$f":"IF(ISBLANK(E87),\"hie eu nix drischribu\",VLOOKUP(E87,'2026'!$A$16:$G$161,3,FALSE))","v":"Stallung Passeraub"}]
["2026-07-12",{"$f":"IF(ISBLANK(D88),\"Alain, nix drischribu\",VLOOKUP(D88,'2026'!$A$16:$G$161,3,FALSE))","v":"Williner Anton"},{"$f":"VLOOKUP(D88,'2026'!$A$16:$B$161,2,FALSE)","v":"Venus"},76,52,{"$f":"VLOOKUP(E88,'2026'!$A$16:$G$161,2,FALSE)","v":"Santana"},{"$f":"IF(ISBLANK(E88),\"hie eu nix drischribu\",VLOOKUP(E88,'2026'!$A$16:$G$161,3,FALSE))","v":"Stallung Jäger & Tscherrig"}]
["2026-07-12",{"$f":"IF(ISBLANK(D89),\"Alain, nix drischribu\",VLOOKUP(D89,'2026'!$A$16:$G$161,3,FALSE))","v":"Stallung Jäger & Tscherrig"},{"$f":"VLOOKUP(D89,'2026'!$A$16:$B$161,2,FALSE)","v":"Santana"},52,76,{"$f":"VLOOKUP(E89,'2026'!$A$16:$G$161,2,FALSE)","v":"Venus"},{"$f":"IF(ISBLANK(E89),\"hie eu nix drischribu\",VLOOKUP(E89,'2026'!$A$16:$G$161,3,FALSE))","v":"Williner Anton"}]
["2026-07-12",{"$f":"IF(ISBLANK(D90),\"Alain, nix drischribu\",VLOOKUP(D90,'2026'!$A$16:$G$161,3,FALSE))","v":"Bayard Medard & Gustav"},{"$f":"VLOOKUP(D90,'2026'!$A$16:$B$161,2,FALSE)","v":"Valerie"},5,16,{"$f":"VLOOKUP(E90,'2026'!$A$16:$G$161,2,FALSE)","v":"Belle"},{"$f":"IF(ISBLANK(E90),\"hie eu nix drischribu\",VLOOKUP(E90,'2026'!$A$16:$G$161,3,FALSE))","v":"Bregy Uli, Lisi & Pascal"}]
["2026-07-12",{"$f":"IF(ISBLANK(D91),\"Alain, nix drischribu\",VLOOKUP(D91,'2026'!$A$16:$G$161,3,FALSE))","v":"Stallung Jäger & Tscherrig"},{"$f":"VLOOKUP(D91,'2026'!$A$16:$B$161,2,FALSE)","v":"Samba"},49,92,{"$f":"VLOOKUP(E91,'2026'!$A$16:$G$161,2,FALSE)","v":"Roseau"},{"$f":"IF(ISBLANK(E91),\"hie eu nix drischribu\",VLOOKUP(E91,'2026'!$A$16:$G$161,3,FALSE))","v":"Zumofen / Gattlen"}]
["2026-07-12",{"$f":"IF(ISBLANK(D92),\"Alain, nix drischribu\",VLOOKUP(D92,'2026'!$A$16:$G$161,3,FALSE))","v":"Bregy Uli, Lisi & Pascal"},{"$f":"VLOOKUP(D92,'2026'!$A$16:$B$161,2,FALSE)","v":"Cora"},13,28,{"$f":"VLOOKUP(E92,'2026'!$A$16:$G$161,2,FALSE)","v":"Luna"},{"$f":"IF(ISBLANK(E92),\"hie eu nix drischribu\",VLOOKUP(E92,'2026'!$A$16:$G$161,3,FALSE))","v":"Gebrüder Jäger"}]
["2026-07-12",{"$f":"IF(ISBLANK(D93),\"Alain, nix drischribu\",VLOOKUP(D93,'2026'!$A$16:$G$161,3,FALSE))","v":"Stallung Jäger & Tscherrig"},{"$f":"VLOOKUP(D93,'2026'!$A$16:$B$161,2,FALSE)","v":"Myla"},55,28,{"$f":"VLOOKUP(E93,'2026'!$A$16:$G$161,2,FALSE)","v":"Luna"},{"$f":"IF(ISBLANK(E93),\"hie eu nix drischribu\",VLOOKUP(E93,'2026'!$A$16:$G$161,3,FALSE))","v":"Gebrüder Jäger"}]
["2026-07-12",{"$f":"IF(ISBLANK(D94),\"Alain, nix drischribu\",VLOOKUP(D94,'2026'!$A$16:$G$161,3,FALSE))","v":"Zumofen / Gattlen"},{"$f":"VLOOKUP(D94,'2026'!$A$16:$B$161,2,FALSE)","v":"Roquette"},86,12,{"$f":"VLOOKUP(E94,'2026'!$A$16:$G$161,2,FALSE)","v":"Cara"},{"$f":"IF(ISBLANK(E94),\"hie eu nix drischribu\",VLOOKUP(E94,'2026'!$A$16:$G$161,3,FALSE))","v":"Bregy Uli, Lisi & Pascal"}]
["2026-07-12",{"$f":"IF(ISBLANK(D95),\"Alain, nix drischribu\",VLOOKUP(D95,'2026'!$A$16:$G$161,3,FALSE))","v":"Stallung Passeraub"},{"$f":"VLOOKUP(D95,'2026'!$A$16:$B$161,2,FALSE)","v":"Malice"},73,3,{"$f":"VLOOKUP(E95,'2026'!$A$16:$G$161,2,FALSE)","v":"Pegasus"},{"$f":"IF(ISBLANK(E95),\"hie eu nix drischribu\",VLOOKUP(E95,'2026'!$A$16:$G$161,3,FALSE))","v":"Bayard Medard & Gustav"}]
["2026-07-12",{"$f":"IF(ISBLANK(D96),\"Alain, nix drischribu\",VLOOKUP(D96,'2026'!$A$16:$G$161,3,FALSE))","v":"Zumofen / Gattlen"},{"$f":"VLOOKUP(D96,'2026'!$A$16:$B$161,2,FALSE)","v":"Roquette"},86,52,{"$f":"VLOOKUP(E96,'2026'!$A$16:$G$161,2,FALSE)","v":"Santana"},{"$f":"IF(ISBLANK(E96),\"hie eu nix drischribu\",VLOOKUP(E96,'2026'!$A$16:$G$161,3,FALSE))","v":"Stallung Jäger & Tscherrig"}]
["2026-07-12",{"$f":"IF(ISBLANK(D97),\"Alain, nix drischribu\",VLOOKUP(D97,'2026'!$A$16:$G$161,3,FALSE))","v":"Williner Anton"},{"$f":"VLOOKUP(D97,'2026'!$A$16:$B$161,2,FALSE)","v":"Timba"},78,63,{"$f":"VLOOKUP(E97,'2026'!$A$16:$G$161,2,FALSE)","v":"Mistral"},{"$f":"IF(ISBLANK(E97),\"hie eu nix drischribu\",VLOOKUP(E97,'2026'!$A$16:$G$161,3,FALSE))","v":"Stallung Mussmann"}]
["2026-07-12",{"$f":"IF(ISBLANK(D98),\"Alain, nix drischribu\",VLOOKUP(D98,'2026'!$A$16:$G$161,3,FALSE))","v":"Williner Anton"},{"$f":"VLOOKUP(D98,'2026'!$A$16:$B$161,2,FALSE)","v":"Venus"},76,82,{"$f":"VLOOKUP(E98,'2026'!$A$16:$G$161,2,FALSE)","v":"Rena"},{"$f":"IF(ISBLANK(E98),\"hie eu nix drischribu\",VLOOKUP(E98,'2026'!$A$16:$G$161,3,FALSE))","v":"Zumofen / Gattlen"}]
["2026-07-11",{"$f":"IF(ISBLANK(D99),\"Alain, nix drischribu\",VLOOKUP(D99,'2026'!$A$16:$G$161,3,FALSE))","v":"Stallung Passeraub"},{"$f":"VLOOKUP(D99,'2026'!$A$16:$B$161,2,FALSE)","v":"Belana"},65,85,{"$f":"VLOOKUP(E99,'2026'!$A$16:$G$161,2,FALSE)","v":"Xea"},{"$f":"IF(ISBLANK(E99),\"hie eu nix drischribu\",VLOOKUP(E99,'2026'!$A$16:$G$161,3,FALSE))","v":"Zumofen / Gattlen"}]
["2026-07-11",{"$f":"IF(ISBLANK(D100),\"Alain, nix drischribu\",VLOOKUP(D100,'2026'!$A$16:$G$161,3,FALSE))","v":"Stallung Passeraub"},{"$f":"VLOOKUP(D100,'2026'!$A$16:$B$161,2,FALSE)","v":"Belle"},70,43,{"$f":"VLOOKUP(E100,'2026'!$A$16:$G$161,2,FALSE)","v":"Baghira"},{"$f":"IF(ISBLANK(E100),\"hie eu nix drischribu\",VLOOKUP(E100,'2026'!$A$16:$G$161,3,FALSE))","v":"Hischier H. & Bühlmann J."}]
["2026-07-11",{"$f":"IF(ISBLANK(D101),\"Alain, nix drischribu\",VLOOKUP(D101,'2026'!$A$16:$G$161,3,FALSE))","v":"Familie Leiggener"},{"$f":"VLOOKUP(D101,'2026'!$A$16:$B$161,2,FALSE)","v":"Royale"},21,19,{"$f":"VLOOKUP(E101,'2026'!$A$16:$G$161,2,FALSE)","v":"Colette"},{"$f":"IF(ISBLANK(E101),\"hie eu nix drischribu\",VLOOKUP(E101,'2026'!$A$16:$G$161,3,FALSE))","v":"Familie Leiggener"}]
["2026-07-11",{"$f":"IF(ISBLANK(D102),\"Alain, nix drischribu\",VLOOKUP(D102,'2026'!$A$16:$G$161,3,FALSE))","v":"Williner Anton"},{"$f":"VLOOKUP(D102,'2026'!$A$16:$B$161,2,FALSE)","v":"Tirana"},77,66,{"$f":"VLOOKUP(E102,'2026'!$A$16:$G$161,2,FALSE)","v":"Beluga"},{"$f":"IF(ISBLANK(E102),\"hie eu nix drischribu\",VLOOKUP(E102,'2026'!$A$16:$G$161,3,FALSE))","v":"Stallung Passeraub"}]
["2026-07-11",{"$f":"IF(ISBLANK(D103),\"Alain, nix drischribu\",VLOOKUP(D103,'2026'!$A$16:$G$161,3,FALSE))","v":"Familie Leiggener"},{"$f":"VLOOKUP(D103,'2026'!$A$16:$B$161,2,FALSE)","v":"Royale"},21,73,{"$f":"VLOOKUP(E103,'2026'!$A$16:$G$161,2,FALSE)","v":"Malice"},{"$f":"IF(ISBLANK(E103),\"hie eu nix drischribu\",VLOOKUP(E103,'2026'!$A$16:$G$161,3,FALSE))","v":"Stallung Passeraub"}]
["2026-07-10",{"$f":"IF(ISBLANK(D104),\"Alain, nix drischribu\",VLOOKUP(D104,'2026'!$A$16:$G$161,3,FALSE))","v":"Stallung Jäger & Tscherrig"},{"$f":"VLOOKUP(D104,'2026'!$A$16:$B$161,2,FALSE)","v":"Pinga"},54,77,{"$f":"VLOOKUP(E104,'2026'!$A$16:$G$161,2,FALSE)","v":"Tirana"},{"$f":"IF(ISBLANK(E104),\"hie eu nix drischribu\",VLOOKUP(E104,'2026'!$A$16:$G$161,3,FALSE))","v":"Williner Anton"}]
["2026-07-10",{"$f":"IF(ISBLANK(D105),\"Alain, nix drischribu\",VLOOKUP(D105,'2026'!$A$16:$G$161,3,FALSE))","v":"Zumofen / Gattlen"},{"$f":"VLOOKUP(D105,'2026'!$A$16:$B$161,2,FALSE)","v":"Xea"},85,67,{"$f":"VLOOKUP(E105,'2026'!$A$16:$G$161,2,FALSE)","v":"Boriana"},{"$f":"IF(ISBLANK(E105),\"hie eu nix drischribu\",VLOOKUP(E105,'2026'!$A$16:$G$161,3,FALSE))","v":"Stallung Passeraub"}]
["2026-07-10",{"$f":"IF(ISBLANK(D106),\"Alain, nix drischribu\",VLOOKUP(D106,'2026'!$A$16:$G$161,3,FALSE))","v":"Gebrüder Jäger"},{"$f":"VLOOKUP(D106,'2026'!$A$16:$B$161,2,FALSE)","v":"Tamango"},30,18,{"$f":"VLOOKUP(E106,'2026'!$A$16:$G$161,2,FALSE)","v":"Calina"},{"$f":"IF(ISBLANK(E106),\"hie eu nix drischribu\",VLOOKUP(E106,'2026'!$A$16:$G$161,3,FALSE))","v":"Bregy Uli, Lisi & Pascal"}]
["2026-07-10",{"$f":"IF(ISBLANK(D107),\"Alain, nix drischribu\",VLOOKUP(D107,'2026'!$A$16:$G$161,3,FALSE))","v":"Stallung Jäger & Tscherrig"},{"$f":"VLOOKUP(D107,'2026'!$A$16:$B$161,2,FALSE)","v":"Fanny"},56,90,{"$f":"VLOOKUP(E107,'2026'!$A$16:$G$161,2,FALSE)","v":"Calcuta"},{"$f":"IF(ISBLANK(E107),\"hie eu nix drischribu\",VLOOKUP(E107,'2026'!$A$16:$G$161,3,FALSE))","v":"Zumofen / Gattlen"}]
["2026-07-10",{"$f":"IF(ISBLANK(D108),\"Alain, nix drischribu\",VLOOKUP(D108,'2026'!$A$16:$G$161,3,FALSE))","v":"Bregy Uli, Lisi & Pascal"},{"$f":"VLOOKUP(D108,'2026'!$A$16:$B$161,2,FALSE)","v":"Samba"},14,47,{"$f":"VLOOKUP(E108,'2026'!$A$16:$G$161,2,FALSE)","v":"Ramona"},{"$f":"IF(ISBLANK(E108),\"hie eu nix drischribu\",VLOOKUP(E108,'2026'!$A$16:$G$161,3,FALSE))","v":"Lauber Noah & Jonas"}]
["2026-07-10",{"$f":"IF(ISBLANK(D109),\"Alain, nix drischribu\",VLOOKUP(D109,'2026'!$A$16:$G$161,3,FALSE))","v":"Stallung Passeraub"},{"$f":"VLOOKUP(D109,'2026'!$A$16:$B$161,2,FALSE)","v":"Brunette"},74,45,{"$f":"VLOOKUP(E109,'2026'!$A$16:$G$161,2,FALSE)","v":"Cayenne"},{"$f":"IF(ISBLANK(E109),\"hie eu nix drischribu\",VLOOKUP(E109,'2026'!$A$16:$G$161,3,FALSE))","v":"Hischier H. & Bühlmann J."}]
["2026-07-10",{"$f":"IF(ISBLANK(D110),\"Alain, nix drischribu\",VLOOKUP(D110,'2026'!$A$16:$G$161,3,FALSE))","v":"Bregy Uli, Lisi & Pascal"},{"$f":"VLOOKUP(D110,'2026'!$A$16:$B$161,2,FALSE)","v":"Perona"},10,74,{"$f":"VLOOKUP(E110,'2026'!$A$16:$G$161,2,FALSE)","v":"Brunette"},{"$f":"IF(ISBLANK(E110),\"hie eu nix drischribu\",VLOOKUP(E110,'2026'!$A$16:$G$161,3,FALSE))","v":"Stallung Passeraub"}]
["2026-07-10",{"$f":"IF(ISBLANK(D111),\"Alain, nix drischribu\",VLOOKUP(D111,'2026'!$A$16:$G$161,3,FALSE))","v":"Stallung Jäger & Tscherrig"},{"$f":"VLOOKUP(D111,'2026'!$A$16:$B$161,2,FALSE)","v":"Bogota"},57,90,{"$f":"VLOOKUP(E111,'2026'!$A$16:$G$161,2,FALSE)","v":"Calcuta"},{"$f":"IF(ISBLANK(E111),\"hie eu nix drischribu\",VLOOKUP(E111,'2026'!$A$16:$G$161,3,FALSE))","v":"Zumofen / Gattlen"}]
["2026-07-10",{"$f":"IF(ISBLANK(D112),\"Alain, nix drischribu\",VLOOKUP(D112,'2026'!$A$16:$G$161,3,FALSE))","v":"Stallung Jäger & Tscherrig"},{"$f":"VLOOKUP(D112,'2026'!$A$16:$B$161,2,FALSE)","v":"Bogota"},57,89,{"$f":"VLOOKUP(E112,'2026'!$A$16:$G$161,2,FALSE)","v":"Verygood"},{"$f":"IF(ISBLANK(E112),\"hie eu nix drischribu\",VLOOKUP(E112,'2026'!$A$16:$G$161,3,FALSE))","v":"Zumofen / Gattlen"}]
["2026-07-10",{"$f":"IF(ISBLANK(D113),\"Alain, nix drischribu\",VLOOKUP(D113,'2026'!$A$16:$G$161,3,FALSE))","v":"Stallung Jäger & Tscherrig"},{"$f":"VLOOKUP(D113,'2026'!$A$16:$B$161,2,FALSE)","v":"Sina"},53,20,{"$f":"VLOOKUP(E113,'2026'!$A$16:$G$161,2,FALSE)","v":"Tirana"},{"$f":"IF(ISBLANK(E113),\"hie eu nix drischribu\",VLOOKUP(E113,'2026'!$A$16:$G$161,3,FALSE))","v":"Familie Leiggener"}]
["2026-07-10",{"$f":"IF(ISBLANK(D114),\"Alain, nix drischribu\",VLOOKUP(D114,'2026'!$A$16:$G$161,3,FALSE))","v":"Stallung Passeraub"},{"$f":"VLOOKUP(D114,'2026'!$A$16:$B$161,2,FALSE)","v":"Bonita"},64,87,{"$f":"VLOOKUP(E114,'2026'!$A$16:$G$161,2,FALSE)","v":"Fame"},{"$f":"IF(ISBLANK(E114),\"hie eu nix drischribu\",VLOOKUP(E114,'2026'!$A$16:$G$161,3,FALSE))","v":"Zumofen / Gattlen"}]
["2026-07-10",{"$f":"IF(ISBLANK(D115),\"Alain, nix drischribu\",VLOOKUP(D115,'2026'!$A$16:$G$161,3,FALSE))","v":"Stallung Jäger & Tscherrig"},{"$f":"VLOOKUP(D115,'2026'!$A$16:$B$161,2,FALSE)","v":"Samoa"},60,68,{"$f":"VLOOKUP(E115,'2026'!$A$16:$G$161,2,FALSE)","v":"Bolienne"},{"$f":"IF(ISBLANK(E115),\"hie eu nix drischribu\",VLOOKUP(E115,'2026'!$A$16:$G$161,3,FALSE))","v":"Stallung Passeraub"}]
["2026-07-10",{"$f":"IF(ISBLANK(D116),\"Alain, nix drischribu\",VLOOKUP(D116,'2026'!$A$16:$G$161,3,FALSE))","v":"Stallung Passeraub"},{"$f":"VLOOKUP(D116,'2026'!$A$16:$B$161,2,FALSE)","v":"Brunette"},74,34,{"$f":"VLOOKUP(E116,'2026'!$A$16:$G$161,2,FALSE)","v":"Mesquine"},{"$f":"IF(ISBLANK(E116),\"hie eu nix drischribu\",VLOOKUP(E116,'2026'!$A$16:$G$161,3,FALSE))","v":"Lötscher Sandrine & Cédric"}]
["2026-07-10",{"$f":"IF(ISBLANK(D117),\"Alain, nix drischribu\",VLOOKUP(D117,'2026'!$A$16:$G$161,3,FALSE))","v":"Stallung Jäger & Tscherrig"},{"$f":"VLOOKUP(D117,'2026'!$A$16:$B$161,2,FALSE)","v":"Samoa"},60,74,{"$f":"VLOOKUP(E117,'2026'!$A$16:$G$161,2,FALSE)","v":"Brunette"},{"$f":"IF(ISBLANK(E117),\"hie eu nix drischribu\",VLOOKUP(E117,'2026'!$A$16:$G$161,3,FALSE))","v":"Stallung Passeraub"}]
["2026-07-10",{"$f":"IF(ISBLANK(D118),\"Alain, nix drischribu\",VLOOKUP(D118,'2026'!$A$16:$G$161,3,FALSE))","v":"Stallung Mussmann"},{"$f":"VLOOKUP(D118,'2026'!$A$16:$B$161,2,FALSE)","v":"Mistral"},63,93,{"$f":"VLOOKUP(E118,'2026'!$A$16:$G$161,2,FALSE)","v":"Farinelle"},{"$f":"IF(ISBLANK(E118),\"hie eu nix drischribu\",VLOOKUP(E118,'2026'!$A$16:$G$161,3,FALSE))","v":"Zumofen / Gattlen"}]
["2026-07-10",{"$f":"IF(ISBLANK(D119),\"Alain, nix drischribu\",VLOOKUP(D119,'2026'!$A$16:$G$161,3,FALSE))","v":"Zumofen / Gattlen"},{"$f":"VLOOKUP(D119,'2026'!$A$16:$B$161,2,FALSE)","v":"Rena"},82,20,{"$f":"VLOOKUP(E119,'2026'!$A$16:$G$161,2,FALSE)","v":"Tirana"},{"$f":"IF(ISBLANK(E119),\"hie eu nix drischribu\",VLOOKUP(E119,'2026'!$A$16:$G$161,3,FALSE))","v":"Familie Leiggener"}]
["2026-07-10",{"$f":"IF(ISBLANK(D120),\"Alain, nix drischribu\",VLOOKUP(D120,'2026'!$A$16:$G$161,3,FALSE))","v":"Stallung Jäger & Tscherrig"},{"$f":"VLOOKUP(D120,'2026'!$A$16:$B$161,2,FALSE)","v":"Santana"},52,21,{"$f":"VLOOKUP(E120,'2026'!$A$16:$G$161,2,FALSE)","v":"Royale"},{"$f":"IF(ISBLANK(E120),\"hie eu nix drischribu\",VLOOKUP(E120,'2026'!$A$16:$G$161,3,FALSE))","v":"Familie Leiggener"}]
["2026-07-10",{"$f":"IF(ISBLANK(D121),\"Alain, nix drischribu\",VLOOKUP(D121,'2026'!$A$16:$G$161,3,FALSE))","v":"Gebrüder Jäger"},{"$f":"VLOOKUP(D121,'2026'!$A$16:$B$161,2,FALSE)","v":"Tamango"},30,13,{"$f":"VLOOKUP(E121,'2026'!$A$16:$G$161,2,FALSE)","v":"Cora"},{"$f":"IF(ISBLANK(E121),\"hie eu nix drischribu\",VLOOKUP(E121,'2026'!$A$16:$G$161,3,FALSE))","v":"Bregy Uli, Lisi & Pascal"}]
["2026-07-10",{"$f":"IF(ISBLANK(D122),\"Alain, nix drischribu\",VLOOKUP(D122,'2026'!$A$16:$G$161,3,FALSE))","v":"Zumofen / Gattlen"},{"$f":"VLOOKUP(D122,'2026'!$A$16:$B$161,2,FALSE)","v":"Rigolo"},83,4,{"$f":"VLOOKUP(E122,'2026'!$A$16:$G$161,2,FALSE)","v":"Vampir"},{"$f":"IF(ISBLANK(E122),\"hie eu nix drischribu\",VLOOKUP(E122,'2026'!$A$16:$G$161,3,FALSE))","v":"Bayard Medard & Gustav"}]
["2026-07-10",{"$f":"IF(ISBLANK(D123),\"Alain, nix drischribu\",VLOOKUP(D123,'2026'!$A$16:$G$161,3,FALSE))","v":"Bregy Alain"},{"$f":"VLOOKUP(D123,'2026'!$A$16:$B$161,2,FALSE)","v":"Banja"},9,6,{"$f":"VLOOKUP(E123,'2026'!$A$16:$G$161,2,FALSE)","v":"Cataille"},{"$f":"IF(ISBLANK(E123),\"hie eu nix drischribu\",VLOOKUP(E123,'2026'!$A$16:$G$161,3,FALSE))","v":"Bregy Alain"}]
["2026-07-10",{"$f":"IF(ISBLANK(D124),\"Alain, nix drischribu\",VLOOKUP(D124,'2026'!$A$16:$G$161,3,FALSE))","v":"Stallung Jäger & Tscherrig"},{"$f":"VLOOKUP(D124,'2026'!$A$16:$B$161,2,FALSE)","v":"Metis"},48,82,{"$f":"VLOOKUP(E124,'2026'!$A$16:$G$161,2,FALSE)","v":"Rena"},{"$f":"IF(ISBLANK(E124),\"hie eu nix drischribu\",VLOOKUP(E124,'2026'!$A$16:$G$161,3,FALSE))","v":"Zumofen / Gattlen"}]
["2026-07-09",{"$f":"IF(ISBLANK(D125),\"Alain, nix drischribu\",VLOOKUP(D125,'2026'!$A$16:$G$161,3,FALSE))","v":"Stallung Passeraub"},{"$f":"VLOOKUP(D125,'2026'!$A$16:$B$161,2,FALSE)","v":"Bonita"},64,89,{"$f":"VLOOKUP(E125,'2026'!$A$16:$G$161,2,FALSE)","v":"Verygood"},{"$f":"IF(ISBLANK(E125),\"hie eu nix drischribu\",VLOOKUP(E125,'2026'!$A$16:$G$161,3,FALSE))","v":"Zumofen / Gattlen"}]
["2026-07-09",{"$f":"IF(ISBLANK(D126),\"Alain, nix drischribu\",VLOOKUP(D126,'2026'!$A$16:$G$161,3,FALSE))","v":"Gebrüder Jäger"},{"$f":"VLOOKUP(D126,'2026'!$A$16:$B$161,2,FALSE)","v":"Soraya"},23,20,{"$f":"VLOOKUP(E126,'2026'!$A$16:$G$161,2,FALSE)","v":"Tirana"},{"$f":"IF(ISBLANK(E126),\"hie eu nix drischribu\",VLOOKUP(E126,'2026'!$A$16:$G$161,3,FALSE))","v":"Familie Leiggener"}]
["2026-07-09",{"$f":"IF(ISBLANK(D127),\"Alain, nix drischribu\",VLOOKUP(D127,'2026'!$A$16:$G$161,3,FALSE))","v":"Zumofen / Gattlen"},{"$f":"VLOOKUP(D127,'2026'!$A$16:$B$161,2,FALSE)","v":"Xena"},80,49,{"$f":"VLOOKUP(E127,'2026'!$A$16:$G$161,2,FALSE)","v":"Samba"},{"$f":"IF(ISBLANK(E127),\"hie eu nix drischribu\",VLOOKUP(E127,'2026'!$A$16:$G$161,3,FALSE))","v":"Stallung Jäger & Tscherrig"}]
["2026-07-09",{"$f":"IF(ISBLANK(D128),\"Alain, nix drischribu\",VLOOKUP(D128,'2026'!$A$16:$G$161,3,FALSE))","v":"Bregy Alain"},{"$f":"VLOOKUP(D128,'2026'!$A$16:$B$161,2,FALSE)","v":"Cataille"},6,88,{"$f":"VLOOKUP(E128,'2026'!$A$16:$G$161,2,FALSE)","v":"Valdeeze"},{"$f":"IF(ISBLANK(E128),\"hie eu nix drischribu\",VLOOKUP(E128,'2026'!$A$16:$G$161,3,FALSE))","v":"Zumofen / Gattlen"}]
["2026-07-09",{"$f":"IF(ISBLANK(D129),\"Alain, nix drischribu\",VLOOKUP(D129,'2026'!$A$16:$G$161,3,FALSE))","v":"Stallung Jäger & Tscherrig"},{"$f":"VLOOKUP(D129,'2026'!$A$16:$B$161,2,FALSE)","v":"Metis"},48,80,{"$f":"VLOOKUP(E129,'2026'!$A$16:$G$161,2,FALSE)","v":"Xena"},{"$f":"IF(ISBLANK(E129),\"hie eu nix drischribu\",VLOOKUP(E129,'2026'!$A$16:$G$161,3,FALSE))","v":"Zumofen / Gattlen"}]
["2026-07-09",{"$f":"IF(ISBLANK(D130),\"Alain, nix drischribu\",VLOOKUP(D130,'2026'!$A$16:$G$161,3,FALSE))","v":"Stallung Jäger & Tscherrig"},{"$f":"VLOOKUP(D130,'2026'!$A$16:$B$161,2,FALSE)","v":"Sina"},53,64,{"$f":"VLOOKUP(E130,'2026'!$A$16:$G$161,2,FALSE)","v":"Bonita"},{"$f":"IF(ISBLANK(E130),\"hie eu nix drischribu\",VLOOKUP(E130,'2026'!$A$16:$G$161,3,FALSE))","v":"Stallung Passeraub"}]
["2026-07-09",{"$f":"IF(ISBLANK(D131),\"Alain, nix drischribu\",VLOOKUP(D131,'2026'!$A$16:$G$161,3,FALSE))","v":"Zumofen / Gattlen"},{"$f":"VLOOKUP(D131,'2026'!$A$16:$B$161,2,FALSE)","v":"Vesuv"},84,91,{"$f":"VLOOKUP(E131,'2026'!$A$16:$G$161,2,FALSE)","v":"Vergara"},{"$f":"IF(ISBLANK(E131),\"hie eu nix drischribu\",VLOOKUP(E131,'2026'!$A$16:$G$161,3,FALSE))","v":"Zumofen / Gattlen"}]
["2026-07-09",{"$f":"IF(ISBLANK(D132),\"Alain, nix drischribu\",VLOOKUP(D132,'2026'!$A$16:$G$161,3,FALSE))","v":"Stallung Jäger & Tscherrig"},{"$f":"VLOOKUP(D132,'2026'!$A$16:$B$161,2,FALSE)","v":"Metis"},48,84,{"$f":"VLOOKUP(E132,'2026'!$A$16:$G$161,2,FALSE)","v":"Vesuv"},{"$f":"IF(ISBLANK(E132),\"hie eu nix drischribu\",VLOOKUP(E132,'2026'!$A$16:$G$161,3,FALSE))","v":"Zumofen / Gattlen"}]
["2026-07-09",{"$f":"IF(ISBLANK(D133),\"Alain, nix drischribu\",VLOOKUP(D133,'2026'!$A$16:$G$161,3,FALSE))","v":"Zumofen / Gattlen"},{"$f":"VLOOKUP(D133,'2026'!$A$16:$B$161,2,FALSE)","v":"Fame"},87,59,{"$f":"VLOOKUP(E133,'2026'!$A$16:$G$161,2,FALSE)","v":"Medusa"},{"$f":"IF(ISBLANK(E133),\"hie eu nix drischribu\",VLOOKUP(E133,'2026'!$A$16:$G$161,3,FALSE))","v":"Stallung Jäger & Tscherrig"}]
["2026-07-08",{"$f":"IF(ISBLANK(D134),\"Alain, nix drischribu\",VLOOKUP(D134,'2026'!$A$16:$G$161,3,FALSE))","v":"Williner Anton"},{"$f":"VLOOKUP(D134,'2026'!$A$16:$B$161,2,FALSE)","v":"Timba"},78,18,{"$f":"VLOOKUP(E134,'2026'!$A$16:$G$161,2,FALSE)","v":"Calina"},{"$f":"IF(ISBLANK(E134),\"hie eu nix drischribu\",VLOOKUP(E134,'2026'!$A$16:$G$161,3,FALSE))","v":"Bregy Uli, Lisi & Pascal"}]
["2026-07-08",{"$f":"IF(ISBLANK(D135),\"Alain, nix drischribu\",VLOOKUP(D135,'2026'!$A$16:$G$161,3,FALSE))","v":"Zumofen / Gattlen"},{"$f":"VLOOKUP(D135,'2026'!$A$16:$B$161,2,FALSE)","v":"Vergara"},91,20,{"$f":"VLOOKUP(E135,'2026'!$A$16:$G$161,2,FALSE)","v":"Tirana"},{"$f":"IF(ISBLANK(E135),\"hie eu nix drischribu\",VLOOKUP(E135,'2026'!$A$16:$G$161,3,FALSE))","v":"Familie Leiggener"}]
["2026-07-08",{"$f":"IF(ISBLANK(D136),\"Alain, nix drischribu\",VLOOKUP(D136,'2026'!$A$16:$G$161,3,FALSE))","v":"Williner Anton"},{"$f":"VLOOKUP(D136,'2026'!$A$16:$B$161,2,FALSE)","v":"Timba"},78,3,{"$f":"VLOOKUP(E136,'2026'!$A$16:$G$161,2,FALSE)","v":"Pegasus"},{"$f":"IF(ISBLANK(E136),\"hie eu nix drischribu\",VLOOKUP(E136,'2026'!$A$16:$G$161,3,FALSE))","v":"Bayard Medard & Gustav"}]
["2026-07-08",{"$f":"IF(ISBLANK(D137),\"Alain, nix drischribu\",VLOOKUP(D137,'2026'!$A$16:$G$161,3,FALSE))","v":"Zumofen / Gattlen"},{"$f":"VLOOKUP(D137,'2026'!$A$16:$B$161,2,FALSE)","v":"Xena"},80,52,{"$f":"VLOOKUP(E137,'2026'!$A$16:$G$161,2,FALSE)","v":"Santana"},{"$f":"IF(ISBLANK(E137),\"hie eu nix drischribu\",VLOOKUP(E137,'2026'!$A$16:$G$161,3,FALSE))","v":"Stallung Jäger & Tscherrig"}]
["2026-07-08",{"$f":"IF(ISBLANK(D138),\"Alain, nix drischribu\",VLOOKUP(D138,'2026'!$A$16:$G$161,3,FALSE))","v":"Stallung Jäger & Tscherrig"},{"$f":"VLOOKUP(D138,'2026'!$A$16:$B$161,2,FALSE)","v":"Metis"},48,82,{"$f":"VLOOKUP(E138,'2026'!$A$16:$G$161,2,FALSE)","v":"Rena"},{"$f":"IF(ISBLANK(E138),\"hie eu nix drischribu\",VLOOKUP(E138,'2026'!$A$16:$G$161,3,FALSE))","v":"Zumofen / Gattlen"}]
["2026-07-08",{"$f":"IF(ISBLANK(D139),\"Alain, nix drischribu\",VLOOKUP(D139,'2026'!$A$16:$G$161,3,FALSE))","v":"Gebrüder Jäger"},{"$f":"VLOOKUP(D139,'2026'!$A$16:$B$161,2,FALSE)","v":"Tamango"},30,17,{"$f":"VLOOKUP(E139,'2026'!$A$16:$G$161,2,FALSE)","v":"Panja"},{"$f":"IF(ISBLANK(E139),\"hie eu nix drischribu\",VLOOKUP(E139,'2026'!$A$16:$G$161,3,FALSE))","v":"Bregy Uli, Lisi & Pascal"}]
["2026-07-08",{"$f":"IF(ISBLANK(D140),\"Alain, nix drischribu\",VLOOKUP(D140,'2026'!$A$16:$G$161,3,FALSE))","v":"Zumofen / Gattlen"},{"$f":"VLOOKUP(D140,'2026'!$A$16:$B$161,2,FALSE)","v":"Fame"},87,75,{"$f":"VLOOKUP(E140,'2026'!$A$16:$G$161,2,FALSE)","v":"Baldrun"},{"$f":"IF(ISBLANK(E140),\"hie eu nix drischribu\",VLOOKUP(E140,'2026'!$A$16:$G$161,3,FALSE))","v":"Stallung Passeraub"}]
["2026-07-08",{"$f":"IF(ISBLANK(D141),\"Alain, nix drischribu\",VLOOKUP(D141,'2026'!$A$16:$G$161,3,FALSE))","v":"Bregy Uli, Lisi & Pascal"},{"$f":"VLOOKUP(D141,'2026'!$A$16:$B$161,2,FALSE)","v":"Perona"},10,73,{"$f":"VLOOKUP(E141,'2026'!$A$16:$G$161,2,FALSE)","v":"Malice"},{"$f":"IF(ISBLANK(E141),\"hie eu nix drischribu\",VLOOKUP(E141,'2026'!$A$16:$G$161,3,FALSE))","v":"Stallung Passeraub"}]
["2026-07-08",{"$f":"IF(ISBLANK(D142),\"Alain, nix drischribu\",VLOOKUP(D142,'2026'!$A$16:$G$161,3,FALSE))","v":"Familie Leiggener"},{"$f":"VLOOKUP(D142,'2026'!$A$16:$B$161,2,FALSE)","v":"Tyson"},22,89,{"$f":"VLOOKUP(E142,'2026'!$A$16:$G$161,2,FALSE)","v":"Verygood"},{"$f":"IF(ISBLANK(E142),\"hie eu nix drischribu\",VLOOKUP(E142,'2026'!$A$16:$G$161,3,FALSE))","v":"Zumofen / Gattlen"}]
["2026-07-08",{"$f":"IF(ISBLANK(D143),\"Alain, nix drischribu\",VLOOKUP(D143,'2026'!$A$16:$G$161,3,FALSE))","v":"Zumofen / Gattlen"},{"$f":"VLOOKUP(D143,'2026'!$A$16:$B$161,2,FALSE)","v":"Roseau"},92,17,{"$f":"VLOOKUP(E143,'2026'!$A$16:$G$161,2,FALSE)","v":"Panja"},{"$f":"IF(ISBLANK(E143),\"hie eu nix drischribu\",VLOOKUP(E143,'2026'!$A$16:$G$161,3,FALSE))","v":"Bregy Uli, Lisi & Pascal"}]
["2026-07-08",{"$f":"IF(ISBLANK(D144),\"Alain, nix drischribu\",VLOOKUP(D144,'2026'!$A$16:$G$161,3,FALSE))","v":"Bregy Uli, Lisi & Pascal"},{"$f":"VLOOKUP(D144,'2026'!$A$16:$B$161,2,FALSE)","v":"Cara"},12,92,{"$f":"VLOOKUP(E144,'2026'!$A$16:$G$161,2,FALSE)","v":"Roseau"},{"$f":"IF(ISBLANK(E144),\"hie eu nix drischribu\",VLOOKUP(E144,'2026'!$A$16:$G$161,3,FALSE))","v":"Zumofen / Gattlen"}]
["2026-07-08",{"$f":"IF(ISBLANK(D145),\"Alain, nix drischribu\",VLOOKUP(D145,'2026'!$A$16:$G$161,3,FALSE))","v":"Zumofen / Gattlen"},{"$f":"VLOOKUP(D145,'2026'!$A$16:$B$161,2,FALSE)","v":"Souris"},81,90,{"$f":"VLOOKUP(E145,'2026'!$A$16:$G$161,2,FALSE)","v":"Calcuta"},{"$f":"IF(ISBLANK(E145),\"hie eu nix drischribu\",VLOOKUP(E145,'2026'!$A$16:$G$161,3,FALSE))","v":"Zumofen / Gattlen"}]
["2026-07-08",{"$f":"IF(ISBLANK(D146),\"Alain, nix drischribu\",VLOOKUP(D146,'2026'!$A$16:$G$161,3,FALSE))","v":"Stallung Passeraub"},{"$f":"VLOOKUP(D146,'2026'!$A$16:$B$161,2,FALSE)","v":"Belle"},70,47,{"$f":"VLOOKUP(E146,'2026'!$A$16:$G$161,2,FALSE)","v":"Ramona"},{"$f":"IF(ISBLANK(E146),\"hie eu nix drischribu\",VLOOKUP(E146,'2026'!$A$16:$G$161,3,FALSE))","v":"Lauber Noah & Jonas"}]
["2026-07-08",{"$f":"IF(ISBLANK(D147),\"Alain, nix drischribu\",VLOOKUP(D147,'2026'!$A$16:$G$161,3,FALSE))","v":"Bayard Medard & Gustav"},{"$f":"VLOOKUP(D147,'2026'!$A$16:$B$161,2,FALSE)","v":"Mamba"},2,21,{"$f":"VLOOKUP(E147,'2026'!$A$16:$G$161,2,FALSE)","v":"Royale"},{"$f":"IF(ISBLANK(E147),\"hie eu nix drischribu\",VLOOKUP(E147,'2026'!$A$16:$G$161,3,FALSE))","v":"Familie Leiggener"}]
["2026-07-08",{"$f":"IF(ISBLANK(D148),\"Alain, nix drischribu\",VLOOKUP(D148,'2026'!$A$16:$G$161,3,FALSE))","v":"Stallung Passeraub"},{"$f":"VLOOKUP(D148,'2026'!$A$16:$B$161,2,FALSE)","v":"Brunette"},74,40,{"$f":"VLOOKUP(E148,'2026'!$A$16:$G$161,2,FALSE)","v":"Pandora"},{"$f":"IF(ISBLANK(E148),\"hie eu nix drischribu\",VLOOKUP(E148,'2026'!$A$16:$G$161,3,FALSE))","v":"Lötscher Sandrine & Cédric"}]
["2026-07-07",{"$f":"IF(ISBLANK(D149),\"Alain, nix drischribu\",VLOOKUP(D149,'2026'!$A$16:$G$161,3,FALSE))","v":"Bregy Alain"},{"$f":"VLOOKUP(D149,'2026'!$A$16:$B$161,2,FALSE)","v":"Banja"},9,88,{"$f":"VLOOKUP(E149,'2026'!$A$16:$G$161,2,FALSE)","v":"Valdeeze"},{"$f":"IF(ISBLANK(E149),\"hie eu nix drischribu\",VLOOKUP(E149,'2026'!$A$16:$G$161,3,FALSE))","v":"Zumofen / Gattlen"}]
["2026-07-07",{"$f":"IF(ISBLANK(D150),\"Alain, nix drischribu\",VLOOKUP(D150,'2026'!$A$16:$G$161,3,FALSE))","v":"Bregy Alain"},{"$f":"VLOOKUP(D150,'2026'!$A$16:$B$161,2,FALSE)","v":"Banja"},9,87,{"$f":"VLOOKUP(E150,'2026'!$A$16:$G$161,2,FALSE)","v":"Fame"},{"$f":"IF(ISBLANK(E150),\"hie eu nix drischribu\",VLOOKUP(E150,'2026'!$A$16:$G$161,3,FALSE))","v":"Zumofen / Gattlen"}]
["2026-07-07",{"$f":"IF(ISBLANK(D151),\"Alain, nix drischribu\",VLOOKUP(D151,'2026'!$A$16:$G$161,3,FALSE))","v":"Zumofen / Gattlen"},{"$f":"VLOOKUP(D151,'2026'!$A$16:$B$161,2,FALSE)","v":"Calcuta"},90,55,{"$f":"VLOOKUP(E151,'2026'!$A$16:$G$161,2,FALSE)","v":"Myla"},{"$f":"IF(ISBLANK(E151),\"hie eu nix drischribu\",VLOOKUP(E151,'2026'!$A$16:$G$161,3,FALSE))","v":"Stallung Jäger & Tscherrig"}]
["2026-07-07",{"$f":"IF(ISBLANK(D152),\"Alain, nix drischribu\",VLOOKUP(D152,'2026'!$A$16:$G$161,3,FALSE))","v":"Stallung Jäger & Tscherrig"},{"$f":"VLOOKUP(D152,'2026'!$A$16:$B$161,2,FALSE)","v":"Santana"},52,81,{"$f":"VLOOKUP(E152,'2026'!$A$16:$G$161,2,FALSE)","v":"Souris"},{"$f":"IF(ISBLANK(E152),\"hie eu nix drischribu\",VLOOKUP(E152,'2026'!$A$16:$G$161,3,FALSE))","v":"Zumofen / Gattlen"}]
["2026-07-07",{"$f":"IF(ISBLANK(D153),\"Alain, nix drischribu\",VLOOKUP(D153,'2026'!$A$16:$G$161,3,FALSE))","v":"Stallung Passeraub"},{"$f":"VLOOKUP(D153,'2026'!$A$16:$B$161,2,FALSE)","v":"Beluga"},66,19,{"$f":"VLOOKUP(E153,'2026'!$A$16:$G$161,2,FALSE)","v":"Colette"},{"$f":"IF(ISBLANK(E153),\"hie eu nix drischribu\",VLOOKUP(E153,'2026'!$A$16:$G$161,3,FALSE))","v":"Familie Leiggener"}]
["2026-07-07",{"$f":"IF(ISBLANK(D154),\"Alain, nix drischribu\",VLOOKUP(D154,'2026'!$A$16:$G$161,3,FALSE))","v":"Stallung Jäger & Tscherrig"},{"$f":"VLOOKUP(D154,'2026'!$A$16:$B$161,2,FALSE)","v":"Sina"},53,75,{"$f":"VLOOKUP(E154,'2026'!$A$16:$G$161,2,FALSE)","v":"Baldrun"},{"$f":"IF(ISBLANK(E154),\"hie eu nix drischribu\",VLOOKUP(E154,'2026'!$A$16:$G$161,3,FALSE))","v":"Stallung Passeraub"}]
["2026-07-07",{"$f":"IF(ISBLANK(D155),\"Alain, nix drischribu\",VLOOKUP(D155,'2026'!$A$16:$G$161,3,FALSE))","v":"Gebrüder Jäger"},{"$f":"VLOOKUP(D155,'2026'!$A$16:$B$161,2,FALSE)","v":"Tamango"},30,45,{"$f":"VLOOKUP(E155,'2026'!$A$16:$G$161,2,FALSE)","v":"Cayenne"},{"$f":"IF(ISBLANK(E155),\"hie eu nix drischribu\",VLOOKUP(E155,'2026'!$A$16:$G$161,3,FALSE))","v":"Hischier H. & Bühlmann J."}]
["2026-07-07",{"$f":"IF(ISBLANK(D156),\"Alain, nix drischribu\",VLOOKUP(D156,'2026'!$A$16:$G$161,3,FALSE))","v":"Williner Anton"},{"$f":"VLOOKUP(D156,'2026'!$A$16:$B$161,2,FALSE)","v":"Dorin"},79,27,{"$f":"VLOOKUP(E156,'2026'!$A$16:$G$161,2,FALSE)","v":"Silene"},{"$f":"IF(ISBLANK(E156),\"hie eu nix drischribu\",VLOOKUP(E156,'2026'!$A$16:$G$161,3,FALSE))","v":"Gebrüder Jäger"}]
["2026-07-07",{"$f":"IF(ISBLANK(D157),\"Alain, nix drischribu\",VLOOKUP(D157,'2026'!$A$16:$G$161,3,FALSE))","v":"Williner Anton"},{"$f":"VLOOKUP(D157,'2026'!$A$16:$B$161,2,FALSE)","v":"Tirana"},77,89,{"$f":"VLOOKUP(E157,'2026'!$A$16:$G$161,2,FALSE)","v":"Verygood"},{"$f":"IF(ISBLANK(E157),\"hie eu nix drischribu\",VLOOKUP(E157,'2026'!$A$16:$G$161,3,FALSE))","v":"Zumofen / Gattlen"}]
["2026-07-06",{"$f":"IF(ISBLANK(D158),\"Alain, nix drischribu\",VLOOKUP(D158,'2026'!$A$16:$G$161,3,FALSE))","v":"Lauber Noah & Jonas"},{"$f":"VLOOKUP(D158,'2026'!$A$16:$B$161,2,FALSE)","v":"Cherico"},46,16,{"$f":"VLOOKUP(E158,'2026'!$A$16:$G$161,2,FALSE)","v":"Belle"},{"$f":"IF(ISBLANK(E158),\"hie eu nix drischribu\",VLOOKUP(E158,'2026'!$A$16:$G$161,3,FALSE))","v":"Bregy Uli, Lisi & Pascal"}]
["2026-07-06",{"$f":"IF(ISBLANK(D159),\"Alain, nix drischribu\",VLOOKUP(D159,'2026'!$A$16:$G$161,3,FALSE))","v":"Stallung Jäger & Tscherrig"},{"$f":"VLOOKUP(D159,'2026'!$A$16:$B$161,2,FALSE)","v":"Fanny"},56,78,{"$f":"VLOOKUP(E159,'2026'!$A$16:$G$161,2,FALSE)","v":"Timba"},{"$f":"IF(ISBLANK(E159),\"hie eu nix drischribu\",VLOOKUP(E159,'2026'!$A$16:$G$161,3,FALSE))","v":"Williner Anton"}]
["2026-07-06",{"$f":"IF(ISBLANK(D160),\"Alain, nix drischribu\",VLOOKUP(D160,'2026'!$A$16:$G$161,3,FALSE))","v":"Zumofen / Gattlen"},{"$f":"VLOOKUP(D160,'2026'!$A$16:$B$161,2,FALSE)","v":"Souris"},81,50,{"$f":"VLOOKUP(E160,'2026'!$A$16:$G$161,2,FALSE)","v":"Beline"},{"$f":"IF(ISBLANK(E160),\"hie eu nix drischribu\",VLOOKUP(E160,'2026'!$A$16:$G$161,3,FALSE))","v":"Stallung Jäger & Tscherrig"}]
["2026-07-06",{"$f":"IF(ISBLANK(D161),\"Alain, nix drischribu\",VLOOKUP(D161,'2026'!$A$16:$G$161,3,FALSE))","v":"Williner Anton"},{"$f":"VLOOKUP(D161,'2026'!$A$16:$B$161,2,FALSE)","v":"Tirana"},77,57,{"$f":"VLOOKUP(E161,'2026'!$A$16:$G$161,2,FALSE)","v":"Bogota"},{"$f":"IF(ISBLANK(E161),\"hie eu nix drischribu\",VLOOKUP(E161,'2026'!$A$16:$G$161,3,FALSE))","v":"Stallung Jäger & Tscherrig"}]
["2026-07-06",{"$f":"IF(ISBLANK(D162),\"Alain, nix drischribu\",VLOOKUP(D162,'2026'!$A$16:$G$161,3,FALSE))","v":"Stallung Jäger & Tscherrig"},{"$f":"VLOOKUP(D162,'2026'!$A$16:$B$161,2,FALSE)","v":"Samba"},49,81,{"$f":"VLOOKUP(E162,'2026'!$A$16:$G$161,2,FALSE)","v":"Souris"},{"$f":"IF(ISBLANK(E162),\"hie eu nix drischribu\",VLOOKUP(E162,'2026'!$A$16:$G$161,3,FALSE))","v":"Zumofen / Gattlen"}]
["2026-07-06",{"$f":"IF(ISBLANK(D163),\"Alain, nix drischribu\",VLOOKUP(D163,'2026'!$A$16:$G$161,3,FALSE))","v":"Bayard Medard & Gustav"},{"$f":"VLOOKUP(D163,'2026'!$A$16:$B$161,2,FALSE)","v":"Mamba"},2,63,{"$f":"VLOOKUP(E163,'2026'!$A$16:$G$161,2,FALSE)","v":"Mistral"},{"$f":"IF(ISBLANK(E163),\"hie eu nix drischribu\",VLOOKUP(E163,'2026'!$A$16:$G$161,3,FALSE))","v":"Stallung Mussmann"}]
["2026-07-06",{"$f":"IF(ISBLANK(D164),\"Alain, nix drischribu\",VLOOKUP(D164,'2026'!$A$16:$G$161,3,FALSE))","v":"Zumofen / Gattlen"},{"$f":"VLOOKUP(D164,'2026'!$A$16:$B$161,2,FALSE)","v":"Rigolo"},83,67,{"$f":"VLOOKUP(E164,'2026'!$A$16:$G$161,2,FALSE)","v":"Boriana"},{"$f":"IF(ISBLANK(E164),\"hie eu nix drischribu\",VLOOKUP(E164,'2026'!$A$16:$G$161,3,FALSE))","v":"Stallung Passeraub"}]
["2026-07-06",{"$f":"IF(ISBLANK(D165),\"Alain, nix drischribu\",VLOOKUP(D165,'2026'!$A$16:$G$161,3,FALSE))","v":"Zumofen / Gattlen"},{"$f":"VLOOKUP(D165,'2026'!$A$16:$B$161,2,FALSE)","v":"Verygood"},89,82,{"$f":"VLOOKUP(E165,'2026'!$A$16:$G$161,2,FALSE)","v":"Rena"},{"$f":"IF(ISBLANK(E165),\"hie eu nix drischribu\",VLOOKUP(E165,'2026'!$A$16:$G$161,3,FALSE))","v":"Zumofen / Gattlen"}]
["2026-07-06",{"$f":"IF(ISBLANK(D166),\"Alain, nix drischribu\",VLOOKUP(D166,'2026'!$A$16:$G$161,3,FALSE))","v":"Zumofen / Gattlen"},{"$f":"VLOOKUP(D166,'2026'!$A$16:$B$161,2,FALSE)","v":"Rena"},82,48,{"$f":"VLOOKUP(E166,'2026'!$A$16:$G$161,2,FALSE)","v":"Metis"},{"$f":"IF(ISBLANK(E166),\"hie eu nix drischribu\",VLOOKUP(E166,'2026'!$A$16:$G$161,3,FALSE))","v":"Stallung Jäger & Tscherrig"}]
["2026-07-05",{"$f":"IF(ISBLANK(D167),\"Alain, nix drischribu\",VLOOKUP(D167,'2026'!$A$16:$G$161,3,FALSE))","v":"Stallung Passeraub"},{"$f":"VLOOKUP(D167,'2026'!$A$16:$B$161,2,FALSE)","v":"Malice"},73,2,{"$f":"VLOOKUP(E167,'2026'!$A$16:$G$161,2,FALSE)","v":"Mamba"},{"$f":"IF(ISBLANK(E167),\"hie eu nix drischribu\",VLOOKUP(E167,'2026'!$A$16:$G$161,3,FALSE))","v":"Bayard Medard & Gustav"}]
["2026-07-05",{"$f":"IF(ISBLANK(D168),\"Alain, nix drischribu\",VLOOKUP(D168,'2026'!$A$16:$G$161,3,FALSE))","v":"Stallung Passeraub"},{"$f":"VLOOKUP(D168,'2026'!$A$16:$B$161,2,FALSE)","v":"Belana"},65,85,{"$f":"VLOOKUP(E168,'2026'!$A$16:$G$161,2,FALSE)","v":"Xea"},{"$f":"IF(ISBLANK(E168),\"hie eu nix drischribu\",VLOOKUP(E168,'2026'!$A$16:$G$161,3,FALSE))","v":"Zumofen / Gattlen"}]
["2026-07-05",{"$f":"IF(ISBLANK(D169),\"Alain, nix drischribu\",VLOOKUP(D169,'2026'!$A$16:$G$161,3,FALSE))","v":"Zumofen / Gattlen"},{"$f":"VLOOKUP(D169,'2026'!$A$16:$B$161,2,FALSE)","v":"Rigolo"},83,86,{"$f":"VLOOKUP(E169,'2026'!$A$16:$G$161,2,FALSE)","v":"Roquette"},{"$f":"IF(ISBLANK(E169),\"hie eu nix drischribu\",VLOOKUP(E169,'2026'!$A$16:$G$161,3,FALSE))","v":"Zumofen / Gattlen"}]
["2026-07-05",{"$f":"IF(ISBLANK(D170),\"Alain, nix drischribu\",VLOOKUP(D170,'2026'!$A$16:$G$161,3,FALSE))","v":"Stallung Passeraub"},{"$f":"VLOOKUP(D170,'2026'!$A$16:$B$161,2,FALSE)","v":"Malice"},73,78,{"$f":"VLOOKUP(E170,'2026'!$A$16:$G$161,2,FALSE)","v":"Timba"},{"$f":"IF(ISBLANK(E170),\"hie eu nix drischribu\",VLOOKUP(E170,'2026'!$A$16:$G$161,3,FALSE))","v":"Williner Anton"}]
["2026-07-05",{"$f":"IF(ISBLANK(D171),\"Alain, nix drischribu\",VLOOKUP(D171,'2026'!$A$16:$G$161,3,FALSE))","v":"Bayard Medard & Gustav"},{"$f":"VLOOKUP(D171,'2026'!$A$16:$B$161,2,FALSE)","v":"Vampir"},4,73,{"$f":"VLOOKUP(E171,'2026'!$A$16:$G$161,2,FALSE)","v":"Malice"},{"$f":"IF(ISBLANK(E171),\"hie eu nix drischribu\",VLOOKUP(E171,'2026'!$A$16:$G$161,3,FALSE))","v":"Stallung Passeraub"}]
["2026-07-05",{"$f":"IF(ISBLANK(D172),\"Alain, nix drischribu\",VLOOKUP(D172,'2026'!$A$16:$G$161,3,FALSE))","v":"Stallung Jäger & Tscherrig"},{"$f":"VLOOKUP(D172,'2026'!$A$16:$B$161,2,FALSE)","v":"Myla"},55,28,{"$f":"VLOOKUP(E172,'2026'!$A$16:$G$161,2,FALSE)","v":"Luna"},{"$f":"IF(ISBLANK(E172),\"hie eu nix drischribu\",VLOOKUP(E172,'2026'!$A$16:$G$161,3,FALSE))","v":"Gebrüder Jäger"}]
["2026-07-05",{"$f":"IF(ISBLANK(D173),\"Alain, nix drischribu\",VLOOKUP(D173,'2026'!$A$16:$G$161,3,FALSE))","v":"Stallung Jäger & Tscherrig"},{"$f":"VLOOKUP(D173,'2026'!$A$16:$B$161,2,FALSE)","v":"Metis"},48,83,{"$f":"VLOOKUP(E173,'2026'!$A$16:$G$161,2,FALSE)","v":"Rigolo"},{"$f":"IF(ISBLANK(E173),\"hie eu nix drischribu\",VLOOKUP(E173,'2026'!$A$16:$G$161,3,FALSE))","v":"Zumofen / Gattlen"}]
["2026-07-05",{"$f":"IF(ISBLANK(D174),\"Alain, nix drischribu\",VLOOKUP(D174,'2026'!$A$16:$G$161,3,FALSE))","v":"Stallung Jäger & Tscherrig"},{"$f":"VLOOKUP(D174,'2026'!$A$16:$B$161,2,FALSE)","v":"Pixel"},58,10,{"$f":"VLOOKUP(E174,'2026'!$A$16:$G$161,2,FALSE)","v":"Perona"},{"$f":"IF(ISBLANK(E174),\"hie eu nix drischribu\",VLOOKUP(E174,'2026'!$A$16:$G$161,3,FALSE))","v":"Bregy Uli, Lisi & Pascal"}]
["2026-07-05",{"$f":"IF(ISBLANK(D175),\"Alain, nix drischribu\",VLOOKUP(D175,'2026'!$A$16:$G$161,3,FALSE))","v":"Stallung Jäger & Tscherrig"},{"$f":"VLOOKUP(D175,'2026'!$A$16:$B$161,2,FALSE)","v":"Pixel"},58,27,{"$f":"VLOOKUP(E175,'2026'!$A$16:$G$161,2,FALSE)","v":"Silene"},{"$f":"IF(ISBLANK(E175),\"hie eu nix drischribu\",VLOOKUP(E175,'2026'!$A$16:$G$161,3,FALSE))","v":"Gebrüder Jäger"}]
["2026-07-05",{"$f":"IF(ISBLANK(D176),\"Alain, nix drischribu\",VLOOKUP(D176,'2026'!$A$16:$G$161,3,FALSE))","v":"Zumofen / Gattlen"},{"$f":"VLOOKUP(D176,'2026'!$A$16:$B$161,2,FALSE)","v":"Roquette"},86,66,{"$f":"VLOOKUP(E176,'2026'!$A$16:$G$161,2,FALSE)","v":"Beluga"},{"$f":"IF(ISBLANK(E176),\"hie eu nix drischribu\",VLOOKUP(E176,'2026'!$A$16:$G$161,3,FALSE))","v":"Stallung Passeraub"}]
["2026-07-05",{"$f":"IF(ISBLANK(D177),\"Alain, nix drischribu\",VLOOKUP(D177,'2026'!$A$16:$G$161,3,FALSE))","v":"Zumofen / Gattlen"},{"$f":"VLOOKUP(D177,'2026'!$A$16:$B$161,2,FALSE)","v":"Rena"},82,48,{"$f":"VLOOKUP(E177,'2026'!$A$16:$G$161,2,FALSE)","v":"Metis"},{"$f":"IF(ISBLANK(E177),\"hie eu nix drischribu\",VLOOKUP(E177,'2026'!$A$16:$G$161,3,FALSE))","v":"Stallung Jäger & Tscherrig"}]
["2026-07-05",{"$f":"IF(ISBLANK(D178),\"Alain, nix drischribu\",VLOOKUP(D178,'2026'!$A$16:$G$161,3,FALSE))","v":"Stallung Jäger & Tscherrig"},{"$f":"VLOOKUP(D178,'2026'!$A$16:$B$161,2,FALSE)","v":"Samba"},49,80,{"$f":"VLOOKUP(E178,'2026'!$A$16:$G$161,2,FALSE)","v":"Xena"},{"$f":"IF(ISBLANK(E178),\"hie eu nix drischribu\",VLOOKUP(E178,'2026'!$A$16:$G$161,3,FALSE))","v":"Zumofen / Gattlen"}]
["2026-07-05",{"$f":"IF(ISBLANK(D179),\"Alain, nix drischribu\",VLOOKUP(D179,'2026'!$A$16:$G$161,3,FALSE))","v":"Zumofen / Gattlen"},{"$f":"VLOOKUP(D179,'2026'!$A$16:$B$161,2,FALSE)","v":"Xena"},80,49,{"$f":"VLOOKUP(E179,'2026'!$A$16:$G$161,2,FALSE)","v":"Samba"},{"$f":"IF(ISBLANK(E179),\"hie eu nix drischribu\",VLOOKUP(E179,'2026'!$A$16:$G$161,3,FALSE))","v":"Stallung Jäger & Tscherrig"}]
["2026-07-05",{"$f":"IF(ISBLANK(D180),\"Alain, nix drischribu\",VLOOKUP(D180,'2026'!$A$16:$G$161,3,FALSE))","v":"Stallung Jäger & Tscherrig"},{"$f":"VLOOKUP(D180,'2026'!$A$16:$B$161,2,FALSE)","v":"Samba"},49,66,{"$f":"VLOOKUP(E180,'2026'!$A$16:$G$161,2,FALSE)","v":"Beluga"},{"$f":"IF(ISBLANK(E180),\"hie eu nix drischribu\",VLOOKUP(E180,'2026'!$A$16:$G$161,3,FALSE))","v":"Stallung Passeraub"}]
["2026-07-05",{"$f":"IF(ISBLANK(D181),\"Alain, nix drischribu\",VLOOKUP(D181,'2026'!$A$16:$G$161,3,FALSE))","v":"Stallung Jäger & Tscherrig"},{"$f":"VLOOKUP(D181,'2026'!$A$16:$B$161,2,FALSE)","v":"Santana"},52,80,{"$f":"VLOOKUP(E181,'2026'!$A$16:$G$161,2,FALSE)","v":"Xena"},{"$f":"IF(ISBLANK(E181),\"hie eu nix drischribu\",VLOOKUP(E181,'2026'!$A$16:$G$161,3,FALSE))","v":"Zumofen / Gattlen"}]
["2026-07-05",{"$f":"IF(ISBLANK(D182),\"Alain, nix drischribu\",VLOOKUP(D182,'2026'!$A$16:$G$161,3,FALSE))","v":"Williner Anton"},{"$f":"VLOOKUP(D182,'2026'!$A$16:$B$161,2,FALSE)","v":"Tirana"},77,80,{"$f":"VLOOKUP(E182,'2026'!$A$16:$G$161,2,FALSE)","v":"Xena"},{"$f":"IF(ISBLANK(E182),\"hie eu nix drischribu\",VLOOKUP(E182,'2026'!$A$16:$G$161,3,FALSE))","v":"Zumofen / Gattlen"}]
["2026-07-05",{"$f":"IF(ISBLANK(D183),\"Alain, nix drischribu\",VLOOKUP(D183,'2026'!$A$16:$G$161,3,FALSE))","v":"Familie Leiggener"},{"$f":"VLOOKUP(D183,'2026'!$A$16:$B$161,2,FALSE)","v":"Tyson"},22,92,{"$f":"VLOOKUP(E183,'2026'!$A$16:$G$161,2,FALSE)","v":"Roseau"},{"$f":"IF(ISBLANK(E183),\"hie eu nix drischribu\",VLOOKUP(E183,'2026'!$A$16:$G$161,3,FALSE))","v":"Zumofen / Gattlen"}]
["2026-07-05",{"$f":"IF(ISBLANK(D184),\"Alain, nix drischribu\",VLOOKUP(D184,'2026'!$A$16:$G$161,3,FALSE))","v":"Zumofen / Gattlen"},{"$f":"VLOOKUP(D184,'2026'!$A$16:$B$161,2,FALSE)","v":"Verygood"},89,22,{"$f":"VLOOKUP(E184,'2026'!$A$16:$G$161,2,FALSE)","v":"Tyson"},{"$f":"IF(ISBLANK(E184),\"hie eu nix drischribu\",VLOOKUP(E184,'2026'!$A$16:$G$161,3,FALSE))","v":"Familie Leiggener"}]
["2026-07-05",{"$f":"IF(ISBLANK(D185),\"Alain, nix drischribu\",VLOOKUP(D185,'2026'!$A$16:$G$161,3,FALSE))","v":"Williner Anton"},{"$f":"VLOOKUP(D185,'2026'!$A$16:$B$161,2,FALSE)","v":"Tirana"},77,73,{"$f":"VLOOKUP(E185,'2026'!$A$16:$G$161,2,FALSE)","v":"Malice"},{"$f":"IF(ISBLANK(E185),\"hie eu nix drischribu\",VLOOKUP(E185,'2026'!$A$16:$G$161,3,FALSE))","v":"Stallung Passeraub"}]
["2026-07-05",{"$f":"IF(ISBLANK(D186),\"Alain, nix drischribu\",VLOOKUP(D186,'2026'!$A$16:$G$161,3,FALSE))","v":"Stallung Mussmann"},{"$f":"VLOOKUP(D186,'2026'!$A$16:$B$161,2,FALSE)","v":"Mistral"},63,69,{"$f":"VLOOKUP(E186,'2026'!$A$16:$G$161,2,FALSE)","v":"Bandera"},{"$f":"IF(ISBLANK(E186),\"hie eu nix drischribu\",VLOOKUP(E186,'2026'!$A$16:$G$161,3,FALSE))","v":"Stallung Passeraub"}]
["2026-07-05",{"$f":"IF(ISBLANK(D187),\"Alain, nix drischribu\",VLOOKUP(D187,'2026'!$A$16:$G$161,3,FALSE))","v":"Lötscher Sandrine & Cédric"},{"$f":"VLOOKUP(D187,'2026'!$A$16:$B$161,2,FALSE)","v":"Pandora"},40,47,{"$f":"VLOOKUP(E187,'2026'!$A$16:$G$161,2,FALSE)","v":"Ramona"},{"$f":"IF(ISBLANK(E187),\"hie eu nix drischribu\",VLOOKUP(E187,'2026'!$A$16:$G$161,3,FALSE))","v":"Lauber Noah & Jonas"}]
["2026-07-04",{"$f":"IF(ISBLANK(D188),\"Alain, nix drischribu\",VLOOKUP(D188,'2026'!$A$16:$G$161,3,FALSE))","v":"Stallung Jäger & Tscherrig"},{"$f":"VLOOKUP(D188,'2026'!$A$16:$B$161,2,FALSE)","v":"Puma"},61,40,{"$f":"VLOOKUP(E188,'2026'!$A$16:$G$161,2,FALSE)","v":"Pandora"},{"$f":"IF(ISBLANK(E188),\"hie eu nix drischribu\",VLOOKUP(E188,'2026'!$A$16:$G$161,3,FALSE))","v":"Lötscher Sandrine & Cédric"}]
["2026-07-04",{"$f":"IF(ISBLANK(D189),\"Alain, nix drischribu\",VLOOKUP(D189,'2026'!$A$16:$G$161,3,FALSE))","v":"Williner Anton"},{"$f":"VLOOKUP(D189,'2026'!$A$16:$B$161,2,FALSE)","v":"Tirana"},77,89,{"$f":"VLOOKUP(E189,'2026'!$A$16:$G$161,2,FALSE)","v":"Verygood"},{"$f":"IF(ISBLANK(E189),\"hie eu nix drischribu\",VLOOKUP(E189,'2026'!$A$16:$G$161,3,FALSE))","v":"Zumofen / Gattlen"}]
["2026-07-04",{"$f":"IF(ISBLANK(D190),\"Alain, nix drischribu\",VLOOKUP(D190,'2026'!$A$16:$G$161,3,FALSE))","v":"Familie Leiggener"},{"$f":"VLOOKUP(D190,'2026'!$A$16:$B$161,2,FALSE)","v":"Colette"},19,89,{"$f":"VLOOKUP(E190,'2026'!$A$16:$G$161,2,FALSE)","v":"Verygood"},{"$f":"IF(ISBLANK(E190),\"hie eu nix drischribu\",VLOOKUP(E190,'2026'!$A$16:$G$161,3,FALSE))","v":"Zumofen / Gattlen"}]
["2026-07-04",{"$f":"IF(ISBLANK(D191),\"Alain, nix drischribu\",VLOOKUP(D191,'2026'!$A$16:$G$161,3,FALSE))","v":"Stallung Jäger & Tscherrig"},{"$f":"VLOOKUP(D191,'2026'!$A$16:$B$161,2,FALSE)","v":"Sina"},53,6,{"$f":"VLOOKUP(E191,'2026'!$A$16:$G$161,2,FALSE)","v":"Cataille"},{"$f":"IF(ISBLANK(E191),\"hie eu nix drischribu\",VLOOKUP(E191,'2026'!$A$16:$G$161,3,FALSE))","v":"Bregy Alain"}]
["2026-07-04",{"$f":"IF(ISBLANK(D192),\"Alain, nix drischribu\",VLOOKUP(D192,'2026'!$A$16:$G$161,3,FALSE))","v":"Bayard Medard & Gustav"},{"$f":"VLOOKUP(D192,'2026'!$A$16:$B$161,2,FALSE)","v":"Mamba"},2,6,{"$f":"VLOOKUP(E192,'2026'!$A$16:$G$161,2,FALSE)","v":"Cataille"},{"$f":"IF(ISBLANK(E192),\"hie eu nix drischribu\",VLOOKUP(E192,'2026'!$A$16:$G$161,3,FALSE))","v":"Bregy Alain"}]
["2026-07-04",{"$f":"IF(ISBLANK(D193),\"Alain, nix drischribu\",VLOOKUP(D193,'2026'!$A$16:$G$161,3,FALSE))","v":"Zumofen / Gattlen"},{"$f":"VLOOKUP(D193,'2026'!$A$16:$B$161,2,FALSE)","v":"Rena"},82,64,{"$f":"VLOOKUP(E193,'2026'!$A$16:$G$161,2,FALSE)","v":"Bonita"},{"$f":"IF(ISBLANK(E193),\"hie eu nix drischribu\",VLOOKUP(E193,'2026'!$A$16:$G$161,3,FALSE))","v":"Stallung Passeraub"}]
["2026-07-03",{"$f":"IF(ISBLANK(D194),\"Alain, nix drischribu\",VLOOKUP(D194,'2026'!$A$16:$G$161,3,FALSE))","v":"Stallung Passeraub"},{"$f":"VLOOKUP(D194,'2026'!$A$16:$B$161,2,FALSE)","v":"Beluga"},66,76,{"$f":"VLOOKUP(E194,'2026'!$A$16:$G$161,2,FALSE)","v":"Venus"},{"$f":"IF(ISBLANK(E194),\"hie eu nix drischribu\",VLOOKUP(E194,'2026'!$A$16:$G$161,3,FALSE))","v":"Williner Anton"}]
["2026-07-03",{"$f":"IF(ISBLANK(D195),\"Alain, nix drischribu\",VLOOKUP(D195,'2026'!$A$16:$G$161,3,FALSE))","v":"Stallung Passeraub"},{"$f":"VLOOKUP(D195,'2026'!$A$16:$B$161,2,FALSE)","v":"Belana"},65,2,{"$f":"VLOOKUP(E195,'2026'!$A$16:$G$161,2,FALSE)","v":"Mamba"},{"$f":"IF(ISBLANK(E195),\"hie eu nix drischribu\",VLOOKUP(E195,'2026'!$A$16:$G$161,3,FALSE))","v":"Bayard Medard & Gustav"}]
["2026-07-03",{"$f":"IF(ISBLANK(D196),\"Alain, nix drischribu\",VLOOKUP(D196,'2026'!$A$16:$G$161,3,FALSE))","v":"Stallung Jäger & Tscherrig"},{"$f":"VLOOKUP(D196,'2026'!$A$16:$B$161,2,FALSE)","v":"Medusa"},59,92,{"$f":"VLOOKUP(E196,'2026'!$A$16:$G$161,2,FALSE)","v":"Roseau"},{"$f":"IF(ISBLANK(E196),\"hie eu nix drischribu\",VLOOKUP(E196,'2026'!$A$16:$G$161,3,FALSE))","v":"Zumofen / Gattlen"}]
["2026-07-03",{"$f":"IF(ISBLANK(D197),\"Alain, nix drischribu\",VLOOKUP(D197,'2026'!$A$16:$G$161,3,FALSE))","v":"Zumofen / Gattlen"},{"$f":"VLOOKUP(D197,'2026'!$A$16:$B$161,2,FALSE)","v":"Xea"},85,54,{"$f":"VLOOKUP(E197,'2026'!$A$16:$G$161,2,FALSE)","v":"Pinga"},{"$f":"IF(ISBLANK(E197),\"hie eu nix drischribu\",VLOOKUP(E197,'2026'!$A$16:$G$161,3,FALSE))","v":"Stallung Jäger & Tscherrig"}]
["2026-07-03",{"$f":"IF(ISBLANK(D198),\"Alain, nix drischribu\",VLOOKUP(D198,'2026'!$A$16:$G$161,3,FALSE))","v":"Hischier H. & Bühlmann J."},{"$f":"VLOOKUP(D198,'2026'!$A$16:$B$161,2,FALSE)","v":"Baghira"},43,8,{"$f":"VLOOKUP(E198,'2026'!$A$16:$G$161,2,FALSE)","v":"Valesia"},{"$f":"IF(ISBLANK(E198),\"hie eu nix drischribu\",VLOOKUP(E198,'2026'!$A$16:$G$161,3,FALSE))","v":"Bregy Alain"}]
["2026-07-03",{"$f":"IF(ISBLANK(D199),\"Alain, nix drischribu\",VLOOKUP(D199,'2026'!$A$16:$G$161,3,FALSE))","v":"Bregy Uli, Lisi & Pascal"},{"$f":"VLOOKUP(D199,'2026'!$A$16:$B$161,2,FALSE)","v":"Cora"},13,47,{"$f":"VLOOKUP(E199,'2026'!$A$16:$G$161,2,FALSE)","v":"Ramona"},{"$f":"IF(ISBLANK(E199),\"hie eu nix drischribu\",VLOOKUP(E199,'2026'!$A$16:$G$161,3,FALSE))","v":"Lauber Noah & Jonas"}]
["2026-07-03",{"$f":"IF(ISBLANK(D200),\"Alain, nix drischribu\",VLOOKUP(D200,'2026'!$A$16:$G$161,3,FALSE))","v":"Stallung Passeraub"},{"$f":"VLOOKUP(D200,'2026'!$A$16:$B$161,2,FALSE)","v":"Bandera"},69,27,{"$f":"VLOOKUP(E200,'2026'!$A$16:$G$161,2,FALSE)","v":"Silene"},{"$f":"IF(ISBLANK(E200),\"hie eu nix drischribu\",VLOOKUP(E200,'2026'!$A$16:$G$161,3,FALSE))","v":"Gebrüder Jäger"}]
["2026-07-02",{"$f":"IF(ISBLANK(D201),\"Alain, nix drischribu\",VLOOKUP(D201,'2026'!$A$16:$G$161,3,FALSE))","v":"Stallung Jäger & Tscherrig"},{"$f":"VLOOKUP(D201,'2026'!$A$16:$B$161,2,FALSE)","v":"Bogota"},57,87,{"$f":"VLOOKUP(E201,'2026'!$A$16:$G$161,2,FALSE)","v":"Fame"},{"$f":"IF(ISBLANK(E201),\"hie eu nix drischribu\",VLOOKUP(E201,'2026'!$A$16:$G$161,3,FALSE))","v":"Zumofen / Gattlen"}]
["2026-07-02",{"$f":"IF(ISBLANK(D202),\"Alain, nix drischribu\",VLOOKUP(D202,'2026'!$A$16:$G$161,3,FALSE))","v":"Stallung Jäger & Tscherrig"},{"$f":"VLOOKUP(D202,'2026'!$A$16:$B$161,2,FALSE)","v":"Bogota"},57,85,{"$f":"VLOOKUP(E202,'2026'!$A$16:$G$161,2,FALSE)","v":"Xea"},{"$f":"IF(ISBLANK(E202),\"hie eu nix drischribu\",VLOOKUP(E202,'2026'!$A$16:$G$161,3,FALSE))","v":"Zumofen / Gattlen"}]
["2026-07-02",{"$f":"IF(ISBLANK(D203),\"Alain, nix drischribu\",VLOOKUP(D203,'2026'!$A$16:$G$161,3,FALSE))","v":"Zumofen / Gattlen"},{"$f":"VLOOKUP(D203,'2026'!$A$16:$B$161,2,FALSE)","v":"Xea"},85,57,{"$f":"VLOOKUP(E203,'2026'!$A$16:$G$161,2,FALSE)","v":"Bogota"},{"$f":"IF(ISBLANK(E203),\"hie eu nix drischribu\",VLOOKUP(E203,'2026'!$A$16:$G$161,3,FALSE))","v":"Stallung Jäger & Tscherrig"}]
["2026-07-02",{"$f":"IF(ISBLANK(D204),\"Alain, nix drischribu\",VLOOKUP(D204,'2026'!$A$16:$G$161,3,FALSE))","v":"Stallung Jäger & Tscherrig"},{"$f":"VLOOKUP(D204,'2026'!$A$16:$B$161,2,FALSE)","v":"Pinga"},54,89,{"$f":"VLOOKUP(E204,'2026'!$A$16:$G$161,2,FALSE)","v":"Verygood"},{"$f":"IF(ISBLANK(E204),\"hie eu nix drischribu\",VLOOKUP(E204,'2026'!$A$16:$G$161,3,FALSE))","v":"Zumofen / Gattlen"}]
["2026-07-02",{"$f":"IF(ISBLANK(D205),\"Alain, nix drischribu\",VLOOKUP(D205,'2026'!$A$16:$G$161,3,FALSE))","v":"Stallung Jäger & Tscherrig"},{"$f":"VLOOKUP(D205,'2026'!$A$16:$B$161,2,FALSE)","v":"Pinga"},54,85,{"$f":"VLOOKUP(E205,'2026'!$A$16:$G$161,2,FALSE)","v":"Xea"},{"$f":"IF(ISBLANK(E205),\"hie eu nix drischribu\",VLOOKUP(E205,'2026'!$A$16:$G$161,3,FALSE))","v":"Zumofen / Gattlen"}]
["2026-07-02",{"$f":"IF(ISBLANK(D206),\"Alain, nix drischribu\",VLOOKUP(D206,'2026'!$A$16:$G$161,3,FALSE))","v":"Zumofen / Gattlen"},{"$f":"VLOOKUP(D206,'2026'!$A$16:$B$161,2,FALSE)","v":"Verygood"},89,22,{"$f":"VLOOKUP(E206,'2026'!$A$16:$G$161,2,FALSE)","v":"Tyson"},{"$f":"IF(ISBLANK(E206),\"hie eu nix drischribu\",VLOOKUP(E206,'2026'!$A$16:$G$161,3,FALSE))","v":"Familie Leiggener"}]
["2026-07-01",{"$f":"IF(ISBLANK(D207),\"Alain, nix drischribu\",VLOOKUP(D207,'2026'!$A$16:$G$161,3,FALSE))","v":"Stallung Passeraub"},{"$f":"VLOOKUP(D207,'2026'!$A$16:$B$161,2,FALSE)","v":"Beluga"},66,85,{"$f":"VLOOKUP(E207,'2026'!$A$16:$G$161,2,FALSE)","v":"Xea"},{"$f":"IF(ISBLANK(E207),\"hie eu nix drischribu\",VLOOKUP(E207,'2026'!$A$16:$G$161,3,FALSE))","v":"Zumofen / Gattlen"}]
["2026-07-01",{"$f":"IF(ISBLANK(D208),\"Alain, nix drischribu\",VLOOKUP(D208,'2026'!$A$16:$G$161,3,FALSE))","v":"Stallung Passeraub"},{"$f":"VLOOKUP(D208,'2026'!$A$16:$B$161,2,FALSE)","v":"Beluga"},66,89,{"$f":"VLOOKUP(E208,'2026'!$A$16:$G$161,2,FALSE)","v":"Verygood"},{"$f":"IF(ISBLANK(E208),\"hie eu nix drischribu\",VLOOKUP(E208,'2026'!$A$16:$G$161,3,FALSE))","v":"Zumofen / Gattlen"}]
["2026-07-01",{"$f":"IF(ISBLANK(D209),\"Alain, nix drischribu\",VLOOKUP(D209,'2026'!$A$16:$G$161,3,FALSE))","v":"Geschwister Lötscher"},{"$f":"VLOOKUP(D209,'2026'!$A$16:$B$161,2,FALSE)","v":"Cobra"},37,45,{"$f":"VLOOKUP(E209,'2026'!$A$16:$G$161,2,FALSE)","v":"Cayenne"},{"$f":"IF(ISBLANK(E209),\"hie eu nix drischribu\",VLOOKUP(E209,'2026'!$A$16:$G$161,3,FALSE))","v":"Hischier H. & Bühlmann J."}]
["2026-07-01",{"$f":"IF(ISBLANK(D210),\"Alain, nix drischribu\",VLOOKUP(D210,'2026'!$A$16:$G$161,3,FALSE))","v":"Stallung Passeraub"},{"$f":"VLOOKUP(D210,'2026'!$A$16:$B$161,2,FALSE)","v":"Beluga"},66,53,{"$f":"VLOOKUP(E210,'2026'!$A$16:$G$161,2,FALSE)","v":"Sina"},{"$f":"IF(ISBLANK(E210),\"hie eu nix drischribu\",VLOOKUP(E210,'2026'!$A$16:$G$161,3,FALSE))","v":"Stallung Jäger & Tscherrig"}]
["2026-07-01",{"$f":"IF(ISBLANK(D211),\"Alain, nix drischribu\",VLOOKUP(D211,'2026'!$A$16:$G$161,3,FALSE))","v":"Bregy Uli, Lisi & Pascal"},{"$f":"VLOOKUP(D211,'2026'!$A$16:$B$161,2,FALSE)","v":"Cora"},13,73,{"$f":"VLOOKUP(E211,'2026'!$A$16:$G$161,2,FALSE)","v":"Malice"},{"$f":"IF(ISBLANK(E211),\"hie eu nix drischribu\",VLOOKUP(E211,'2026'!$A$16:$G$161,3,FALSE))","v":"Stallung Passeraub"}]
["2026-07-01",{"$f":"IF(ISBLANK(D212),\"Alain, nix drischribu\",VLOOKUP(D212,'2026'!$A$16:$G$161,3,FALSE))","v":"Stallung Passeraub"},{"$f":"VLOOKUP(D212,'2026'!$A$16:$B$161,2,FALSE)","v":"Belana"},65,66,{"$f":"VLOOKUP(E212,'2026'!$A$16:$G$161,2,FALSE)","v":"Beluga"},{"$f":"IF(ISBLANK(E212),\"hie eu nix drischribu\",VLOOKUP(E212,'2026'!$A$16:$G$161,3,FALSE))","v":"Stallung Passeraub"}]
["2026-07-01",{"$f":"IF(ISBLANK(D213),\"Alain, nix drischribu\",VLOOKUP(D213,'2026'!$A$16:$G$161,3,FALSE))","v":"Bayard Medard & Gustav"},{"$f":"VLOOKUP(D213,'2026'!$A$16:$B$161,2,FALSE)","v":"Mamba"},2,19,{"$f":"VLOOKUP(E213,'2026'!$A$16:$G$161,2,FALSE)","v":"Colette"},{"$f":"IF(ISBLANK(E213),\"hie eu nix drischribu\",VLOOKUP(E213,'2026'!$A$16:$G$161,3,FALSE))","v":"Familie Leiggener"}]
["2026-07-01",{"$f":"IF(ISBLANK(D214),\"Alain, nix drischribu\",VLOOKUP(D214,'2026'!$A$16:$G$161,3,FALSE))","v":"Bayard Medard & Gustav"},{"$f":"VLOOKUP(D214,'2026'!$A$16:$B$161,2,FALSE)","v":"Vampir"},4,57,{"$f":"VLOOKUP(E214,'2026'!$A$16:$G$161,2,FALSE)","v":"Bogota"},{"$f":"IF(ISBLANK(E214),\"hie eu nix drischribu\",VLOOKUP(E214,'2026'!$A$16:$G$161,3,FALSE))","v":"Stallung Jäger & Tscherrig"}]
["2026-06-30",{"$f":"IF(ISBLANK(D215),\"Alain, nix drischribu\",VLOOKUP(D215,'2026'!$A$16:$G$161,3,FALSE))","v":"Familie Leiggener"},{"$f":"VLOOKUP(D215,'2026'!$A$16:$B$161,2,FALSE)","v":"Tirana"},20,24,{"$f":"VLOOKUP(E215,'2026'!$A$16:$G$161,2,FALSE)","v":"Tamara"},{"$f":"IF(ISBLANK(E215),\"hie eu nix drischribu\",VLOOKUP(E215,'2026'!$A$16:$G$161,3,FALSE))","v":"Gebrüder Jäger"}]
["2026-06-30",{"$f":"IF(ISBLANK(D216),\"Alain, nix drischribu\",VLOOKUP(D216,'2026'!$A$16:$G$161,3,FALSE))","v":"Gebrüder Jäger"},{"$f":"VLOOKUP(D216,'2026'!$A$16:$B$161,2,FALSE)","v":"Soraya"},23,76,{"$f":"VLOOKUP(E216,'2026'!$A$16:$G$161,2,FALSE)","v":"Venus"},{"$f":"IF(ISBLANK(E216),\"hie eu nix drischribu\",VLOOKUP(E216,'2026'!$A$16:$G$161,3,FALSE))","v":"Williner Anton"}]
["2026-06-30",{"$f":"IF(ISBLANK(D217),\"Alain, nix drischribu\",VLOOKUP(D217,'2026'!$A$16:$G$161,3,FALSE))","v":"Williner Anton"},{"$f":"VLOOKUP(D217,'2026'!$A$16:$B$161,2,FALSE)","v":"Tirana"},77,85,{"$f":"VLOOKUP(E217,'2026'!$A$16:$G$161,2,FALSE)","v":"Xea"},{"$f":"IF(ISBLANK(E217),\"hie eu nix drischribu\",VLOOKUP(E217,'2026'!$A$16:$G$161,3,FALSE))","v":"Zumofen / Gattlen"}]
["2026-06-30",{"$f":"IF(ISBLANK(D218),\"Alain, nix drischribu\",VLOOKUP(D218,'2026'!$A$16:$G$161,3,FALSE))","v":"Stallung Jäger & Tscherrig"},{"$f":"VLOOKUP(D218,'2026'!$A$16:$B$161,2,FALSE)","v":"Bijou"},51,74,{"$f":"VLOOKUP(E218,'2026'!$A$16:$G$161,2,FALSE)","v":"Brunette"},{"$f":"IF(ISBLANK(E218),\"hie eu nix drischribu\",VLOOKUP(E218,'2026'!$A$16:$G$161,3,FALSE))","v":"Stallung Passeraub"}]
["2026-06-30",{"$f":"IF(ISBLANK(D219),\"Alain, nix drischribu\",VLOOKUP(D219,'2026'!$A$16:$G$161,3,FALSE))","v":"Stallung Jäger & Tscherrig"},{"$f":"VLOOKUP(D219,'2026'!$A$16:$B$161,2,FALSE)","v":"Bijou"},51,72,{"$f":"VLOOKUP(E219,'2026'!$A$16:$G$161,2,FALSE)","v":"Poseidon"},{"$f":"IF(ISBLANK(E219),\"hie eu nix drischribu\",VLOOKUP(E219,'2026'!$A$16:$G$161,3,FALSE))","v":"Hutter Richard"}]
["2026-06-30",{"$f":"IF(ISBLANK(D220),\"Alain, nix drischribu\",VLOOKUP(D220,'2026'!$A$16:$G$161,3,FALSE))","v":"Bregy Alain"},{"$f":"VLOOKUP(D220,'2026'!$A$16:$B$161,2,FALSE)","v":"Bilbao"},7,30,{"$f":"VLOOKUP(E220,'2026'!$A$16:$G$161,2,FALSE)","v":"Tamango"},{"$f":"IF(ISBLANK(E220),\"hie eu nix drischribu\",VLOOKUP(E220,'2026'!$A$16:$G$161,3,FALSE))","v":"Gebrüder Jäger"}]
["2026-06-30",{"$f":"IF(ISBLANK(D221),\"Alain, nix drischribu\",VLOOKUP(D221,'2026'!$A$16:$G$161,3,FALSE))","v":"Stallung Passeraub"},{"$f":"VLOOKUP(D221,'2026'!$A$16:$B$161,2,FALSE)","v":"Baldrun"},75,19,{"$f":"VLOOKUP(E221,'2026'!$A$16:$G$161,2,FALSE)","v":"Colette"},{"$f":"IF(ISBLANK(E221),\"hie eu nix drischribu\",VLOOKUP(E221,'2026'!$A$16:$G$161,3,FALSE))","v":"Familie Leiggener"}]
["2026-06-30",{"$f":"IF(ISBLANK(D222),\"Alain, nix drischribu\",VLOOKUP(D222,'2026'!$A$16:$G$161,3,FALSE))","v":"Williner Anton"},{"$f":"VLOOKUP(D222,'2026'!$A$16:$B$161,2,FALSE)","v":"Dorin"},79,37,{"$f":"VLOOKUP(E222,'2026'!$A$16:$G$161,2,FALSE)","v":"Cobra"},{"$f":"IF(ISBLANK(E222),\"hie eu nix drischribu\",VLOOKUP(E222,'2026'!$A$16:$G$161,3,FALSE))","v":"Geschwister Lötscher"}]
["2026-06-30",{"$f":"IF(ISBLANK(D223),\"Alain, nix drischribu\",VLOOKUP(D223,'2026'!$A$16:$G$161,3,FALSE))","v":"Bayard Medard & Gustav"},{"$f":"VLOOKUP(D223,'2026'!$A$16:$B$161,2,FALSE)","v":"Mamba"},2,50,{"$f":"VLOOKUP(E223,'2026'!$A$16:$G$161,2,FALSE)","v":"Beline"},{"$f":"IF(ISBLANK(E223),\"hie eu nix drischribu\",VLOOKUP(E223,'2026'!$A$16:$G$161,3,FALSE))","v":"Stallung Jäger & Tscherrig"}]
["2026-06-30",{"$f":"IF(ISBLANK(D224),\"Alain, nix drischribu\",VLOOKUP(D224,'2026'!$A$16:$G$161,3,FALSE))","v":"Hischier H. & Bühlmann J."},{"$f":"VLOOKUP(D224,'2026'!$A$16:$B$161,2,FALSE)","v":"Alena"},42,34,{"$f":"VLOOKUP(E224,'2026'!$A$16:$G$161,2,FALSE)","v":"Mesquine"},{"$f":"IF(ISBLANK(E224),\"hie eu nix drischribu\",VLOOKUP(E224,'2026'!$A$16:$G$161,3,FALSE))","v":"Lötscher Sandrine & Cédric"}]
["2026-06-30",{"$f":"IF(ISBLANK(D225),\"Alain, nix drischribu\",VLOOKUP(D225,'2026'!$A$16:$G$161,3,FALSE))","v":"Lötscher Sandrine & Cédric"},{"$f":"VLOOKUP(D225,'2026'!$A$16:$B$161,2,FALSE)","v":"Pandora"},40,42,{"$f":"VLOOKUP(E225,'2026'!$A$16:$G$161,2,FALSE)","v":"Alena"},{"$f":"IF(ISBLANK(E225),\"hie eu nix drischribu\",VLOOKUP(E225,'2026'!$A$16:$G$161,3,FALSE))","v":"Hischier H. & Bühlmann J."}]
["2026-06-29",{"$f":"IF(ISBLANK(D226),\"Alain, nix drischribu\",VLOOKUP(D226,'2026'!$A$16:$G$161,3,FALSE))","v":"Zumofen / Gattlen"},{"$f":"VLOOKUP(D226,'2026'!$A$16:$B$161,2,FALSE)","v":"Vergara"},91,17,{"$f":"VLOOKUP(E226,'2026'!$A$16:$G$161,2,FALSE)","v":"Panja"},{"$f":"IF(ISBLANK(E226),\"hie eu nix drischribu\",VLOOKUP(E226,'2026'!$A$16:$G$161,3,FALSE))","v":"Bregy Uli, Lisi & Pascal"}]
["2026-06-29",{"$f":"IF(ISBLANK(D227),\"Alain, nix drischribu\",VLOOKUP(D227,'2026'!$A$16:$G$161,3,FALSE))","v":"Zumofen / Gattlen"},{"$f":"VLOOKUP(D227,'2026'!$A$16:$B$161,2,FALSE)","v":"Fame"},87,60,{"$f":"VLOOKUP(E227,'2026'!$A$16:$G$161,2,FALSE)","v":"Samoa"},{"$f":"IF(ISBLANK(E227),\"hie eu nix drischribu\",VLOOKUP(E227,'2026'!$A$16:$G$161,3,FALSE))","v":"Stallung Jäger & Tscherrig"}]
["2026-06-29",{"$f":"IF(ISBLANK(D228),\"Alain, nix drischribu\",VLOOKUP(D228,'2026'!$A$16:$G$161,3,FALSE))","v":"Familie Leiggener"},{"$f":"VLOOKUP(D228,'2026'!$A$16:$B$161,2,FALSE)","v":"Tyson"},22,76,{"$f":"VLOOKUP(E228,'2026'!$A$16:$G$161,2,FALSE)","v":"Venus"},{"$f":"IF(ISBLANK(E228),\"hie eu nix drischribu\",VLOOKUP(E228,'2026'!$A$16:$G$161,3,FALSE))","v":"Williner Anton"}]
["2026-06-29",{"$f":"IF(ISBLANK(D229),\"Alain, nix drischribu\",VLOOKUP(D229,'2026'!$A$16:$G$161,3,FALSE))","v":"Zumofen / Gattlen"},{"$f":"VLOOKUP(D229,'2026'!$A$16:$B$161,2,FALSE)","v":"Vergara"},91,8,{"$f":"VLOOKUP(E229,'2026'!$A$16:$G$161,2,FALSE)","v":"Valesia"},{"$f":"IF(ISBLANK(E229),\"hie eu nix drischribu\",VLOOKUP(E229,'2026'!$A$16:$G$161,3,FALSE))","v":"Bregy Alain"}]
["2026-06-29",{"$f":"IF(ISBLANK(D230),\"Alain, nix drischribu\",VLOOKUP(D230,'2026'!$A$16:$G$161,3,FALSE))","v":"Stallung Passeraub"},{"$f":"VLOOKUP(D230,'2026'!$A$16:$B$161,2,FALSE)","v":"Bandera"},69,61,{"$f":"VLOOKUP(E230,'2026'!$A$16:$G$161,2,FALSE)","v":"Puma"},{"$f":"IF(ISBLANK(E230),\"hie eu nix drischribu\",VLOOKUP(E230,'2026'!$A$16:$G$161,3,FALSE))","v":"Stallung Jäger & Tscherrig"}]
["2026-06-29",{"$f":"IF(ISBLANK(D231),\"Alain, nix drischribu\",VLOOKUP(D231,'2026'!$A$16:$G$161,3,FALSE))","v":"Zumofen / Gattlen"},{"$f":"VLOOKUP(D231,'2026'!$A$16:$B$161,2,FALSE)","v":"Verygood"},89,2,{"$f":"VLOOKUP(E231,'2026'!$A$16:$G$161,2,FALSE)","v":"Mamba"},{"$f":"IF(ISBLANK(E231),\"hie eu nix drischribu\",VLOOKUP(E231,'2026'!$A$16:$G$161,3,FALSE))","v":"Bayard Medard & Gustav"}]
["2026-06-29",{"$f":"IF(ISBLANK(D232),\"Alain, nix drischribu\",VLOOKUP(D232,'2026'!$A$16:$G$161,3,FALSE))","v":"Stallung Passeraub"},{"$f":"VLOOKUP(D232,'2026'!$A$16:$B$161,2,FALSE)","v":"Bandera"},69,4,{"$f":"VLOOKUP(E232,'2026'!$A$16:$G$161,2,FALSE)","v":"Vampir"},{"$f":"IF(ISBLANK(E232),\"hie eu nix drischribu\",VLOOKUP(E232,'2026'!$A$16:$G$161,3,FALSE))","v":"Bayard Medard & Gustav"}]
["2026-06-29",{"$f":"IF(ISBLANK(D233),\"Alain, nix drischribu\",VLOOKUP(D233,'2026'!$A$16:$G$161,3,FALSE))","v":"Bayard Medard & Gustav"},{"$f":"VLOOKUP(D233,'2026'!$A$16:$B$161,2,FALSE)","v":"Mamba"},2,12,{"$f":"VLOOKUP(E233,'2026'!$A$16:$G$161,2,FALSE)","v":"Cara"},{"$f":"IF(ISBLANK(E233),\"hie eu nix drischribu\",VLOOKUP(E233,'2026'!$A$16:$G$161,3,FALSE))","v":"Bregy Uli, Lisi & Pascal"}]
["2026-06-29",{"$f":"IF(ISBLANK(D234),\"Alain, nix drischribu\",VLOOKUP(D234,'2026'!$A$16:$G$161,3,FALSE))","v":"Stallung Mussmann"},{"$f":"VLOOKUP(D234,'2026'!$A$16:$B$161,2,FALSE)","v":"Mistral"},63,3,{"$f":"VLOOKUP(E234,'2026'!$A$16:$G$161,2,FALSE)","v":"Pegasus"},{"$f":"IF(ISBLANK(E234),\"hie eu nix drischribu\",VLOOKUP(E234,'2026'!$A$16:$G$161,3,FALSE))","v":"Bayard Medard & Gustav"}]
["2026-06-29",{"$f":"IF(ISBLANK(D235),\"Alain, nix drischribu\",VLOOKUP(D235,'2026'!$A$16:$G$161,3,FALSE))","v":"Stallung Passeraub"},{"$f":"VLOOKUP(D235,'2026'!$A$16:$B$161,2,FALSE)","v":"Malice"},73,19,{"$f":"VLOOKUP(E235,'2026'!$A$16:$G$161,2,FALSE)","v":"Colette"},{"$f":"IF(ISBLANK(E235),\"hie eu nix drischribu\",VLOOKUP(E235,'2026'!$A$16:$G$161,3,FALSE))","v":"Familie Leiggener"}]
["2026-06-28",{"$f":"IF(ISBLANK(D236),\"Alain, nix drischribu\",VLOOKUP(D236,'2026'!$A$16:$G$161,3,FALSE))","v":"Hutter Richard"},{"$f":"VLOOKUP(D236,'2026'!$A$16:$B$161,2,FALSE)","v":"Fiona"},71,90,{"$f":"VLOOKUP(E236,'2026'!$A$16:$G$161,2,FALSE)","v":"Calcuta"},{"$f":"IF(ISBLANK(E236),\"hie eu nix drischribu\",VLOOKUP(E236,'2026'!$A$16:$G$161,3,FALSE))","v":"Zumofen / Gattlen"}]
["2026-06-28",{"$f":"IF(ISBLANK(D237),\"Alain, nix drischribu\",VLOOKUP(D237,'2026'!$A$16:$G$161,3,FALSE))","v":"Williner Anton"},{"$f":"VLOOKUP(D237,'2026'!$A$16:$B$161,2,FALSE)","v":"Tirana"},77,85,{"$f":"VLOOKUP(E237,'2026'!$A$16:$G$161,2,FALSE)","v":"Xea"},{"$f":"IF(ISBLANK(E237),\"hie eu nix drischribu\",VLOOKUP(E237,'2026'!$A$16:$G$161,3,FALSE))","v":"Zumofen / Gattlen"}]
["2026-06-28",{"$f":"IF(ISBLANK(D238),\"Alain, nix drischribu\",VLOOKUP(D238,'2026'!$A$16:$G$161,3,FALSE))","v":"Stallung Passeraub"},{"$f":"VLOOKUP(D238,'2026'!$A$16:$B$161,2,FALSE)","v":"Bandera"},69,75,{"$f":"VLOOKUP(E238,'2026'!$A$16:$G$161,2,FALSE)","v":"Baldrun"},{"$f":"IF(ISBLANK(E238),\"hie eu nix drischribu\",VLOOKUP(E238,'2026'!$A$16:$G$161,3,FALSE))","v":"Stallung Passeraub"}]
["2026-06-27",{"$f":"IF(ISBLANK(D239),\"Alain, nix drischribu\",VLOOKUP(D239,'2026'!$A$16:$G$161,3,FALSE))","v":"Stallung Jäger & Tscherrig"},{"$f":"VLOOKUP(D239,'2026'!$A$16:$B$161,2,FALSE)","v":"Bogota"},57,11,{"$f":"VLOOKUP(E239,'2026'!$A$16:$G$161,2,FALSE)","v":"Tirana"},{"$f":"IF(ISBLANK(E239),\"hie eu nix drischribu\",VLOOKUP(E239,'2026'!$A$16:$G$161,3,FALSE))","v":"Bregy Uli, Lisi & Pascal"}]
["2026-06-27",{"$f":"IF(ISBLANK(D240),\"Alain, nix drischribu\",VLOOKUP(D240,'2026'!$A$16:$G$161,3,FALSE))","v":"Bayard Medard & Gustav"},{"$f":"VLOOKUP(D240,'2026'!$A$16:$B$161,2,FALSE)","v":"Vampir"},4,84,{"$f":"VLOOKUP(E240,'2026'!$A$16:$G$161,2,FALSE)","v":"Vesuv"},{"$f":"IF(ISBLANK(E240),\"hie eu nix drischribu\",VLOOKUP(E240,'2026'!$A$16:$G$161,3,FALSE))","v":"Zumofen / Gattlen"}]
["2026-06-27",{"$f":"IF(ISBLANK(D241),\"Alain, nix drischribu\",VLOOKUP(D241,'2026'!$A$16:$G$161,3,FALSE))","v":"Stallung Passeraub"},{"$f":"VLOOKUP(D241,'2026'!$A$16:$B$161,2,FALSE)","v":"Bandera"},69,74,{"$f":"VLOOKUP(E241,'2026'!$A$16:$G$161,2,FALSE)","v":"Brunette"},{"$f":"IF(ISBLANK(E241),\"hie eu nix drischribu\",VLOOKUP(E241,'2026'!$A$16:$G$161,3,FALSE))","v":"Stallung Passeraub"}]
["2026-06-27",{"$f":"IF(ISBLANK(D242),\"Alain, nix drischribu\",VLOOKUP(D242,'2026'!$A$16:$G$161,3,FALSE))","v":"Bregy Uli, Lisi & Pascal"},{"$f":"VLOOKUP(D242,'2026'!$A$16:$B$161,2,FALSE)","v":"Cara"},12,89,{"$f":"VLOOKUP(E242,'2026'!$A$16:$G$161,2,FALSE)","v":"Verygood"},{"$f":"IF(ISBLANK(E242),\"hie eu nix drischribu\",VLOOKUP(E242,'2026'!$A$16:$G$161,3,FALSE))","v":"Zumofen / Gattlen"}]
["2026-06-27",{"$f":"IF(ISBLANK(D243),\"Alain, nix drischribu\",VLOOKUP(D243,'2026'!$A$16:$G$161,3,FALSE))","v":"Zumofen / Gattlen"},{"$f":"VLOOKUP(D243,'2026'!$A$16:$B$161,2,FALSE)","v":"Verygood"},89,12,{"$f":"VLOOKUP(E243,'2026'!$A$16:$G$161,2,FALSE)","v":"Cara"},{"$f":"IF(ISBLANK(E243),\"hie eu nix drischribu\",VLOOKUP(E243,'2026'!$A$16:$G$161,3,FALSE))","v":"Bregy Uli, Lisi & Pascal"}]
["2026-06-27",{"$f":"IF(ISBLANK(D244),\"Alain, nix drischribu\",VLOOKUP(D244,'2026'!$A$16:$G$161,3,FALSE))","v":"Zumofen / Gattlen"},{"$f":"VLOOKUP(D244,'2026'!$A$16:$B$161,2,FALSE)","v":"Verygood"},89,13,{"$f":"VLOOKUP(E244,'2026'!$A$16:$G$161,2,FALSE)","v":"Cora"},{"$f":"IF(ISBLANK(E244),\"hie eu nix drischribu\",VLOOKUP(E244,'2026'!$A$16:$G$161,3,FALSE))","v":"Bregy Uli, Lisi & Pascal"}]
["2026-06-27",{"$f":"IF(ISBLANK(D245),\"Alain, nix drischribu\",VLOOKUP(D245,'2026'!$A$16:$G$161,3,FALSE))","v":"Gebrüder Jäger"},{"$f":"VLOOKUP(D245,'2026'!$A$16:$B$161,2,FALSE)","v":"Soraya"},23,69,{"$f":"VLOOKUP(E245,'2026'!$A$16:$G$161,2,FALSE)","v":"Bandera"},{"$f":"IF(ISBLANK(E245),\"hie eu nix drischribu\",VLOOKUP(E245,'2026'!$A$16:$G$161,3,FALSE))","v":"Stallung Passeraub"}]
["2026-06-27",{"$f":"IF(ISBLANK(D246),\"Alain, nix drischribu\",VLOOKUP(D246,'2026'!$A$16:$G$161,3,FALSE))","v":"Bayard Medard & Gustav"},{"$f":"VLOOKUP(D246,'2026'!$A$16:$B$161,2,FALSE)","v":"Mamba"},2,36,{"$f":"VLOOKUP(E246,'2026'!$A$16:$G$161,2,FALSE)","v":"Perle"},{"$f":"IF(ISBLANK(E246),\"hie eu nix drischribu\",VLOOKUP(E246,'2026'!$A$16:$G$161,3,FALSE))","v":"Lötscher Sandrine & Cédric"}]
["2026-06-27",{"$f":"IF(ISBLANK(D247),\"Alain, nix drischribu\",VLOOKUP(D247,'2026'!$A$16:$G$161,3,FALSE))","v":"Zumofen / Gattlen"},{"$f":"VLOOKUP(D247,'2026'!$A$16:$B$161,2,FALSE)","v":"Xea"},85,65,{"$f":"VLOOKUP(E247,'2026'!$A$16:$G$161,2,FALSE)","v":"Belana"},{"$f":"IF(ISBLANK(E247),\"hie eu nix drischribu\",VLOOKUP(E247,'2026'!$A$16:$G$161,3,FALSE))","v":"Stallung Passeraub"}]
["2026-06-27",{"$f":"IF(ISBLANK(D248),\"Alain, nix drischribu\",VLOOKUP(D248,'2026'!$A$16:$G$161,3,FALSE))","v":"Lötscher Sandrine & Cédric"},{"$f":"VLOOKUP(D248,'2026'!$A$16:$B$161,2,FALSE)","v":"Pandora"},40,74,{"$f":"VLOOKUP(E248,'2026'!$A$16:$G$161,2,FALSE)","v":"Brunette"},{"$f":"IF(ISBLANK(E248),\"hie eu nix drischribu\",VLOOKUP(E248,'2026'!$A$16:$G$161,3,FALSE))","v":"Stallung Passeraub"}]
["2026-06-26",{"$f":"IF(ISBLANK(D249),\"Alain, nix drischribu\",VLOOKUP(D249,'2026'!$A$16:$G$161,3,FALSE))","v":"Bregy Uli, Lisi & Pascal"},{"$f":"VLOOKUP(D249,'2026'!$A$16:$B$161,2,FALSE)","v":"Perona"},10,73,{"$f":"VLOOKUP(E249,'2026'!$A$16:$G$161,2,FALSE)","v":"Malice"},{"$f":"IF(ISBLANK(E249),\"hie eu nix drischribu\",VLOOKUP(E249,'2026'!$A$16:$G$161,3,FALSE))","v":"Stallung Passeraub"}]
["2026-06-26",{"$f":"IF(ISBLANK(D250),\"Alain, nix drischribu\",VLOOKUP(D250,'2026'!$A$16:$G$161,3,FALSE))","v":"Zumofen / Gattlen"},{"$f":"VLOOKUP(D250,'2026'!$A$16:$B$161,2,FALSE)","v":"Rigolo"},83,54,{"$f":"VLOOKUP(E250,'2026'!$A$16:$G$161,2,FALSE)","v":"Pinga"},{"$f":"IF(ISBLANK(E250),\"hie eu nix drischribu\",VLOOKUP(E250,'2026'!$A$16:$G$161,3,FALSE))","v":"Stallung Jäger & Tscherrig"}]
["2026-06-26",{"$f":"IF(ISBLANK(D251),\"Alain, nix drischribu\",VLOOKUP(D251,'2026'!$A$16:$G$161,3,FALSE))","v":"Stallung Jäger & Tscherrig"},{"$f":"VLOOKUP(D251,'2026'!$A$16:$B$161,2,FALSE)","v":"Metis"},48,83,{"$f":"VLOOKUP(E251,'2026'!$A$16:$G$161,2,FALSE)","v":"Rigolo"},{"$f":"IF(ISBLANK(E251),\"hie eu nix drischribu\",VLOOKUP(E251,'2026'!$A$16:$G$161,3,FALSE))","v":"Zumofen / Gattlen"}]
["2026-06-26",{"$f":"IF(ISBLANK(D252),\"Alain, nix drischribu\",VLOOKUP(D252,'2026'!$A$16:$G$161,3,FALSE))","v":"Lötscher Sandrine & Cédric"},{"$f":"VLOOKUP(D252,'2026'!$A$16:$B$161,2,FALSE)","v":"Pandora"},40,31,{"$f":"VLOOKUP(E252,'2026'!$A$16:$G$161,2,FALSE)","v":"Santana"},{"$f":"IF(ISBLANK(E252),\"hie eu nix drischribu\",VLOOKUP(E252,'2026'!$A$16:$G$161,3,FALSE))","v":"Gebrüder Jäger"}]
["2026-06-26",{"$f":"IF(ISBLANK(D253),\"Alain, nix drischribu\",VLOOKUP(D253,'2026'!$A$16:$G$161,3,FALSE))","v":"Bregy Uli, Lisi & Pascal"},{"$f":"VLOOKUP(D253,'2026'!$A$16:$B$161,2,FALSE)","v":"Belle"},16,40,{"$f":"VLOOKUP(E253,'2026'!$A$16:$G$161,2,FALSE)","v":"Pandora"},{"$f":"IF(ISBLANK(E253),\"hie eu nix drischribu\",VLOOKUP(E253,'2026'!$A$16:$G$161,3,FALSE))","v":"Lötscher Sandrine & Cédric"}]
["2026-06-26",{"$f":"IF(ISBLANK(D254),\"Alain, nix drischribu\",VLOOKUP(D254,'2026'!$A$16:$G$161,3,FALSE))","v":"Hischier H. & Bühlmann J."},{"$f":"VLOOKUP(D254,'2026'!$A$16:$B$161,2,FALSE)","v":"Baghira"},43,13,{"$f":"VLOOKUP(E254,'2026'!$A$16:$G$161,2,FALSE)","v":"Cora"},{"$f":"IF(ISBLANK(E254),\"hie eu nix drischribu\",VLOOKUP(E254,'2026'!$A$16:$G$161,3,FALSE))","v":"Bregy Uli, Lisi & Pascal"}]
["2026-06-26",{"$f":"IF(ISBLANK(D255),\"Alain, nix drischribu\",VLOOKUP(D255,'2026'!$A$16:$G$161,3,FALSE))","v":"Stallung Passeraub"},{"$f":"VLOOKUP(D255,'2026'!$A$16:$B$161,2,FALSE)","v":"Belle"},70,78,{"$f":"VLOOKUP(E255,'2026'!$A$16:$G$161,2,FALSE)","v":"Timba"},{"$f":"IF(ISBLANK(E255),\"hie eu nix drischribu\",VLOOKUP(E255,'2026'!$A$16:$G$161,3,FALSE))","v":"Williner Anton"}]
["2026-06-26",{"$f":"IF(ISBLANK(D256),\"Alain, nix drischribu\",VLOOKUP(D256,'2026'!$A$16:$G$161,3,FALSE))","v":"Stallung Jäger & Tscherrig"},{"$f":"VLOOKUP(D256,'2026'!$A$16:$B$161,2,FALSE)","v":"Pixel"},58,14,{"$f":"VLOOKUP(E256,'2026'!$A$16:$G$161,2,FALSE)","v":"Samba"},{"$f":"IF(ISBLANK(E256),\"hie eu nix drischribu\",VLOOKUP(E256,'2026'!$A$16:$G$161,3,FALSE))","v":"Bregy Uli, Lisi & Pascal"}]
["2026-06-26",{"$f":"IF(ISBLANK(D257),\"Alain, nix drischribu\",VLOOKUP(D257,'2026'!$A$16:$G$161,3,FALSE))","v":"Bayard Jan"},{"$f":"VLOOKUP(D257,'2026'!$A$16:$B$161,2,FALSE)","v":"Vaya"},1,59,{"$f":"VLOOKUP(E257,'2026'!$A$16:$G$161,2,FALSE)","v":"Medusa"},{"$f":"IF(ISBLANK(E257),\"hie eu nix drischribu\",VLOOKUP(E257,'2026'!$A$16:$G$161,3,FALSE))","v":"Stallung Jäger & Tscherrig"}]
["2026-06-26",{"$f":"IF(ISBLANK(D258),\"Alain, nix drischribu\",VLOOKUP(D258,'2026'!$A$16:$G$161,3,FALSE))","v":"Stallung Jäger & Tscherrig"},{"$f":"VLOOKUP(D258,'2026'!$A$16:$B$161,2,FALSE)","v":"Samoa"},60,68,{"$f":"VLOOKUP(E258,'2026'!$A$16:$G$161,2,FALSE)","v":"Bolienne"},{"$f":"IF(ISBLANK(E258),\"hie eu nix drischribu\",VLOOKUP(E258,'2026'!$A$16:$G$161,3,FALSE))","v":"Stallung Passeraub"}]
["2026-06-26",{"$f":"IF(ISBLANK(D259),\"Alain, nix drischribu\",VLOOKUP(D259,'2026'!$A$16:$G$161,3,FALSE))","v":"Stallung Mussmann"},{"$f":"VLOOKUP(D259,'2026'!$A$16:$B$161,2,FALSE)","v":"Mistral"},63,3,{"$f":"VLOOKUP(E259,'2026'!$A$16:$G$161,2,FALSE)","v":"Pegasus"},{"$f":"IF(ISBLANK(E259),\"hie eu nix drischribu\",VLOOKUP(E259,'2026'!$A$16:$G$161,3,FALSE))","v":"Bayard Medard & Gustav"}]
["2026-06-26",{"$f":"IF(ISBLANK(D260),\"Alain, nix drischribu\",VLOOKUP(D260,'2026'!$A$16:$G$161,3,FALSE))","v":"Stallung Jäger & Tscherrig"},{"$f":"VLOOKUP(D260,'2026'!$A$16:$B$161,2,FALSE)","v":"Metis"},48,86,{"$f":"VLOOKUP(E260,'2026'!$A$16:$G$161,2,FALSE)","v":"Roquette"},{"$f":"IF(ISBLANK(E260),\"hie eu nix drischribu\",VLOOKUP(E260,'2026'!$A$16:$G$161,3,FALSE))","v":"Zumofen / Gattlen"}]
["2026-06-26",{"$f":"IF(ISBLANK(D261),\"Alain, nix drischribu\",VLOOKUP(D261,'2026'!$A$16:$G$161,3,FALSE))","v":"Stallung Jäger & Tscherrig"},{"$f":"VLOOKUP(D261,'2026'!$A$16:$B$161,2,FALSE)","v":"Samoa"},60,64,{"$f":"VLOOKUP(E261,'2026'!$A$16:$G$161,2,FALSE)","v":"Bonita"},{"$f":"IF(ISBLANK(E261),\"hie eu nix drischribu\",VLOOKUP(E261,'2026'!$A$16:$G$161,3,FALSE))","v":"Stallung Passeraub"}]
["2026-06-26",{"$f":"IF(ISBLANK(D262),\"Alain, nix drischribu\",VLOOKUP(D262,'2026'!$A$16:$G$161,3,FALSE))","v":"Bregy Uli, Lisi & Pascal"},{"$f":"VLOOKUP(D262,'2026'!$A$16:$B$161,2,FALSE)","v":"Perona"},10,3,{"$f":"VLOOKUP(E262,'2026'!$A$16:$G$161,2,FALSE)","v":"Pegasus"},{"$f":"IF(ISBLANK(E262),\"hie eu nix drischribu\",VLOOKUP(E262,'2026'!$A$16:$G$161,3,FALSE))","v":"Bayard Medard & Gustav"}]
["2026-06-25",{"$f":"IF(ISBLANK(D263),\"Alain, nix drischribu\",VLOOKUP(D263,'2026'!$A$16:$G$161,3,FALSE))","v":"Hischier H. & Bühlmann J."},{"$f":"VLOOKUP(D263,'2026'!$A$16:$B$161,2,FALSE)","v":"Baghira"},43,78,{"$f":"VLOOKUP(E263,'2026'!$A$16:$G$161,2,FALSE)","v":"Timba"},{"$f":"IF(ISBLANK(E263),\"hie eu nix drischribu\",VLOOKUP(E263,'2026'!$A$16:$G$161,3,FALSE))","v":"Williner Anton"}]
["2026-06-25",{"$f":"IF(ISBLANK(D264),\"Alain, nix drischribu\",VLOOKUP(D264,'2026'!$A$16:$G$161,3,FALSE))","v":"Zumofen / Gattlen"},{"$f":"VLOOKUP(D264,'2026'!$A$16:$B$161,2,FALSE)","v":"Vergara"},91,25,{"$f":"VLOOKUP(E264,'2026'!$A$16:$G$161,2,FALSE)","v":"Tirana"},{"$f":"IF(ISBLANK(E264),\"hie eu nix drischribu\",VLOOKUP(E264,'2026'!$A$16:$G$161,3,FALSE))","v":"Gebrüder Jäger"}]
["2026-06-25",{"$f":"IF(ISBLANK(D265),\"Alain, nix drischribu\",VLOOKUP(D265,'2026'!$A$16:$G$161,3,FALSE))","v":"Familie Leiggener"},{"$f":"VLOOKUP(D265,'2026'!$A$16:$B$161,2,FALSE)","v":"Tyson"},22,36,{"$f":"VLOOKUP(E265,'2026'!$A$16:$G$161,2,FALSE)","v":"Perle"},{"$f":"IF(ISBLANK(E265),\"hie eu nix drischribu\",VLOOKUP(E265,'2026'!$A$16:$G$161,3,FALSE))","v":"Lötscher Sandrine & Cédric"}]
["2026-06-25",{"$f":"IF(ISBLANK(D266),\"Alain, nix drischribu\",VLOOKUP(D266,'2026'!$A$16:$G$161,3,FALSE))","v":"Bayard Medard & Gustav"},{"$f":"VLOOKUP(D266,'2026'!$A$16:$B$161,2,FALSE)","v":"Mamba"},2,25,{"$f":"VLOOKUP(E266,'2026'!$A$16:$G$161,2,FALSE)","v":"Tirana"},{"$f":"IF(ISBLANK(E266),\"hie eu nix drischribu\",VLOOKUP(E266,'2026'!$A$16:$G$161,3,FALSE))","v":"Gebrüder Jäger"}]
["2026-06-25",{"$f":"IF(ISBLANK(D267),\"Alain, nix drischribu\",VLOOKUP(D267,'2026'!$A$16:$G$161,3,FALSE))","v":"Zumofen / Gattlen"},{"$f":"VLOOKUP(D267,'2026'!$A$16:$B$161,2,FALSE)","v":"Farinelle"},93,11,{"$f":"VLOOKUP(E267,'2026'!$A$16:$G$161,2,FALSE)","v":"Tirana"},{"$f":"IF(ISBLANK(E267),\"hie eu nix drischribu\",VLOOKUP(E267,'2026'!$A$16:$G$161,3,FALSE))","v":"Bregy Uli, Lisi & Pascal"}]
["2026-06-25",{"$f":"IF(ISBLANK(D268),\"Alain, nix drischribu\",VLOOKUP(D268,'2026'!$A$16:$G$161,3,FALSE))","v":"Bregy Alain"},{"$f":"VLOOKUP(D268,'2026'!$A$16:$B$161,2,FALSE)","v":"Valesia"},8,31,{"$f":"VLOOKUP(E268,'2026'!$A$16:$G$161,2,FALSE)","v":"Santana"},{"$f":"IF(ISBLANK(E268),\"hie eu nix drischribu\",VLOOKUP(E268,'2026'!$A$16:$G$161,3,FALSE))","v":"Gebrüder Jäger"}]
["2026-06-25",{"$f":"IF(ISBLANK(D269),\"Alain, nix drischribu\",VLOOKUP(D269,'2026'!$A$16:$G$161,3,FALSE))","v":"Zumofen / Gattlen"},{"$f":"VLOOKUP(D269,'2026'!$A$16:$B$161,2,FALSE)","v":"Rigolo"},83,19,{"$f":"VLOOKUP(E269,'2026'!$A$16:$G$161,2,FALSE)","v":"Colette"},{"$f":"IF(ISBLANK(E269),\"hie eu nix drischribu\",VLOOKUP(E269,'2026'!$A$16:$G$161,3,FALSE))","v":"Familie Leiggener"}]
["2026-06-25",{"$f":"IF(ISBLANK(D270),\"Alain, nix drischribu\",VLOOKUP(D270,'2026'!$A$16:$G$161,3,FALSE))","v":"Zumofen / Gattlen"},{"$f":"VLOOKUP(D270,'2026'!$A$16:$B$161,2,FALSE)","v":"Verygood"},89,57,{"$f":"VLOOKUP(E270,'2026'!$A$16:$G$161,2,FALSE)","v":"Bogota"},{"$f":"IF(ISBLANK(E270),\"hie eu nix drischribu\",VLOOKUP(E270,'2026'!$A$16:$G$161,3,FALSE))","v":"Stallung Jäger & Tscherrig"}]
["2026-06-25",{"$f":"IF(ISBLANK(D271),\"Alain, nix drischribu\",VLOOKUP(D271,'2026'!$A$16:$G$161,3,FALSE))","v":"Stallung Jäger & Tscherrig"},{"$f":"VLOOKUP(D271,'2026'!$A$16:$B$161,2,FALSE)","v":"Fanny"},56,37,{"$f":"VLOOKUP(E271,'2026'!$A$16:$G$161,2,FALSE)","v":"Cobra"},{"$f":"IF(ISBLANK(E271),\"hie eu nix drischribu\",VLOOKUP(E271,'2026'!$A$16:$G$161,3,FALSE))","v":"Geschwister Lötscher"}]
["2026-06-25",{"$f":"IF(ISBLANK(D272),\"Alain, nix drischribu\",VLOOKUP(D272,'2026'!$A$16:$G$161,3,FALSE))","v":"Bayard Medard & Gustav"},{"$f":"VLOOKUP(D272,'2026'!$A$16:$B$161,2,FALSE)","v":"Pegasus"},3,42,{"$f":"VLOOKUP(E272,'2026'!$A$16:$G$161,2,FALSE)","v":"Alena"},{"$f":"IF(ISBLANK(E272),\"hie eu nix drischribu\",VLOOKUP(E272,'2026'!$A$16:$G$161,3,FALSE))","v":"Hischier H. & Bühlmann J."}]
["2026-06-25",{"$f":"IF(ISBLANK(D273),\"Alain, nix drischribu\",VLOOKUP(D273,'2026'!$A$16:$G$161,3,FALSE))","v":"Bregy Uli, Lisi & Pascal"},{"$f":"VLOOKUP(D273,'2026'!$A$16:$B$161,2,FALSE)","v":"Panja"},17,72,{"$f":"VLOOKUP(E273,'2026'!$A$16:$G$161,2,FALSE)","v":"Poseidon"},{"$f":"IF(ISBLANK(E273),\"hie eu nix drischribu\",VLOOKUP(E273,'2026'!$A$16:$G$161,3,FALSE))","v":"Hutter Richard"}]
["2026-06-25",{"$f":"IF(ISBLANK(D274),\"Alain, nix drischribu\",VLOOKUP(D274,'2026'!$A$16:$G$161,3,FALSE))","v":"Bayard Medard & Gustav"},{"$f":"VLOOKUP(D274,'2026'!$A$16:$B$161,2,FALSE)","v":"Vampir"},4,77,{"$f":"VLOOKUP(E274,'2026'!$A$16:$G$161,2,FALSE)","v":"Tirana"},{"$f":"IF(ISBLANK(E274),\"hie eu nix drischribu\",VLOOKUP(E274,'2026'!$A$16:$G$161,3,FALSE))","v":"Williner Anton"}]
["2026-06-24",{"$f":"IF(ISBLANK(D275),\"Alain, nix drischribu\",VLOOKUP(D275,'2026'!$A$16:$G$161,3,FALSE))","v":"Stallung Passeraub"},{"$f":"VLOOKUP(D275,'2026'!$A$16:$B$161,2,FALSE)","v":"Bonita"},64,82,{"$f":"VLOOKUP(E275,'2026'!$A$16:$G$161,2,FALSE)","v":"Rena"},{"$f":"IF(ISBLANK(E275),\"hie eu nix drischribu\",VLOOKUP(E275,'2026'!$A$16:$G$161,3,FALSE))","v":"Zumofen / Gattlen"}]
["2026-06-24",{"$f":"IF(ISBLANK(D276),\"Alain, nix drischribu\",VLOOKUP(D276,'2026'!$A$16:$G$161,3,FALSE))","v":"Williner Anton"},{"$f":"VLOOKUP(D276,'2026'!$A$16:$B$161,2,FALSE)","v":"Venus"},76,55,{"$f":"VLOOKUP(E276,'2026'!$A$16:$G$161,2,FALSE)","v":"Myla"},{"$f":"IF(ISBLANK(E276),\"hie eu nix drischribu\",VLOOKUP(E276,'2026'!$A$16:$G$161,3,FALSE))","v":"Stallung Jäger & Tscherrig"}]
["2026-06-24",{"$f":"IF(ISBLANK(D277),\"Alain, nix drischribu\",VLOOKUP(D277,'2026'!$A$16:$G$161,3,FALSE))","v":"Stallung Jäger & Tscherrig"},{"$f":"VLOOKUP(D277,'2026'!$A$16:$B$161,2,FALSE)","v":"Pixel"},58,5,{"$f":"VLOOKUP(E277,'2026'!$A$16:$G$161,2,FALSE)","v":"Valerie"},{"$f":"IF(ISBLANK(E277),\"hie eu nix drischribu\",VLOOKUP(E277,'2026'!$A$16:$G$161,3,FALSE))","v":"Bayard Medard & Gustav"}]
["2026-06-24",{"$f":"IF(ISBLANK(D278),\"Alain, nix drischribu\",VLOOKUP(D278,'2026'!$A$16:$G$161,3,FALSE))","v":"Zumofen / Gattlen"},{"$f":"VLOOKUP(D278,'2026'!$A$16:$B$161,2,FALSE)","v":"Farinelle"},93,74,{"$f":"VLOOKUP(E278,'2026'!$A$16:$G$161,2,FALSE)","v":"Brunette"},{"$f":"IF(ISBLANK(E278),\"hie eu nix drischribu\",VLOOKUP(E278,'2026'!$A$16:$G$161,3,FALSE))","v":"Stallung Passeraub"}]
["2026-06-24",{"$f":"IF(ISBLANK(D279),\"Alain, nix drischribu\",VLOOKUP(D279,'2026'!$A$16:$G$161,3,FALSE))","v":"Bayard Medard & Gustav"},{"$f":"VLOOKUP(D279,'2026'!$A$16:$B$161,2,FALSE)","v":"Vampir"},4,63,{"$f":"VLOOKUP(E279,'2026'!$A$16:$G$161,2,FALSE)","v":"Mistral"},{"$f":"IF(ISBLANK(E279),\"hie eu nix drischribu\",VLOOKUP(E279,'2026'!$A$16:$G$161,3,FALSE))","v":"Stallung Mussmann"}]
["2026-06-24",{"$f":"IF(ISBLANK(D280),\"Alain, nix drischribu\",VLOOKUP(D280,'2026'!$A$16:$G$161,3,FALSE))","v":"Stallung Jäger & Tscherrig"},{"$f":"VLOOKUP(D280,'2026'!$A$16:$B$161,2,FALSE)","v":"Sina"},53,89,{"$f":"VLOOKUP(E280,'2026'!$A$16:$G$161,2,FALSE)","v":"Verygood"},{"$f":"IF(ISBLANK(E280),\"hie eu nix drischribu\",VLOOKUP(E280,'2026'!$A$16:$G$161,3,FALSE))","v":"Zumofen / Gattlen"}]
["2026-06-24",{"$f":"IF(ISBLANK(D281),\"Alain, nix drischribu\",VLOOKUP(D281,'2026'!$A$16:$G$161,3,FALSE))","v":"Zumofen / Gattlen"},{"$f":"VLOOKUP(D281,'2026'!$A$16:$B$161,2,FALSE)","v":"Xea"},85,22,{"$f":"VLOOKUP(E281,'2026'!$A$16:$G$161,2,FALSE)","v":"Tyson"},{"$f":"IF(ISBLANK(E281),\"hie eu nix drischribu\",VLOOKUP(E281,'2026'!$A$16:$G$161,3,FALSE))","v":"Familie Leiggener"}]
["2026-06-24",{"$f":"IF(ISBLANK(D282),\"Alain, nix drischribu\",VLOOKUP(D282,'2026'!$A$16:$G$161,3,FALSE))","v":"Bayard Medard & Gustav"},{"$f":"VLOOKUP(D282,'2026'!$A$16:$B$161,2,FALSE)","v":"Vampir"},4,21,{"$f":"VLOOKUP(E282,'2026'!$A$16:$G$161,2,FALSE)","v":"Royale"},{"$f":"IF(ISBLANK(E282),\"hie eu nix drischribu\",VLOOKUP(E282,'2026'!$A$16:$G$161,3,FALSE))","v":"Familie Leiggener"}]
["2026-06-24",{"$f":"IF(ISBLANK(D283),\"Alain, nix drischribu\",VLOOKUP(D283,'2026'!$A$16:$G$161,3,FALSE))","v":"Bayard Medard & Gustav"},{"$f":"VLOOKUP(D283,'2026'!$A$16:$B$161,2,FALSE)","v":"Mamba"},2,25,{"$f":"VLOOKUP(E283,'2026'!$A$16:$G$161,2,FALSE)","v":"Tirana"},{"$f":"IF(ISBLANK(E283),\"hie eu nix drischribu\",VLOOKUP(E283,'2026'!$A$16:$G$161,3,FALSE))","v":"Gebrüder Jäger"}]
["2026-06-24",{"$f":"IF(ISBLANK(D284),\"Alain, nix drischribu\",VLOOKUP(D284,'2026'!$A$16:$G$161,3,FALSE))","v":"Stallung Jäger & Tscherrig"},{"$f":"VLOOKUP(D284,'2026'!$A$16:$B$161,2,FALSE)","v":"Pinga"},54,31,{"$f":"VLOOKUP(E284,'2026'!$A$16:$G$161,2,FALSE)","v":"Santana"},{"$f":"IF(ISBLANK(E284),\"hie eu nix drischribu\",VLOOKUP(E284,'2026'!$A$16:$G$161,3,FALSE))","v":"Gebrüder Jäger"}]
["2026-06-24",{"$f":"IF(ISBLANK(D285),\"Alain, nix drischribu\",VLOOKUP(D285,'2026'!$A$16:$G$161,3,FALSE))","v":"Bregy Uli, Lisi & Pascal"},{"$f":"VLOOKUP(D285,'2026'!$A$16:$B$161,2,FALSE)","v":"Tirana"},11,34,{"$f":"VLOOKUP(E285,'2026'!$A$16:$G$161,2,FALSE)","v":"Mesquine"},{"$f":"IF(ISBLANK(E285),\"hie eu nix drischribu\",VLOOKUP(E285,'2026'!$A$16:$G$161,3,FALSE))","v":"Lötscher Sandrine & Cédric"}]
["2026-06-24",{"$f":"IF(ISBLANK(D286),\"Alain, nix drischribu\",VLOOKUP(D286,'2026'!$A$16:$G$161,3,FALSE))","v":"Stallung Jäger & Tscherrig"},{"$f":"VLOOKUP(D286,'2026'!$A$16:$B$161,2,FALSE)","v":"Fanny"},56,71,{"$f":"VLOOKUP(E286,'2026'!$A$16:$G$161,2,FALSE)","v":"Fiona"},{"$f":"IF(ISBLANK(E286),\"hie eu nix drischribu\",VLOOKUP(E286,'2026'!$A$16:$G$161,3,FALSE))","v":"Hutter Richard"}]
["2026-06-24",{"$f":"IF(ISBLANK(D287),\"Alain, nix drischribu\",VLOOKUP(D287,'2026'!$A$16:$G$161,3,FALSE))","v":"Bayard Medard & Gustav"},{"$f":"VLOOKUP(D287,'2026'!$A$16:$B$161,2,FALSE)","v":"Vampir"},4,58,{"$f":"VLOOKUP(E287,'2026'!$A$16:$G$161,2,FALSE)","v":"Pixel"},{"$f":"IF(ISBLANK(E287),\"hie eu nix drischribu\",VLOOKUP(E287,'2026'!$A$16:$G$161,3,FALSE))","v":"Stallung Jäger & Tscherrig"}]
["2026-06-24",{"$f":"IF(ISBLANK(D288),\"Alain, nix drischribu\",VLOOKUP(D288,'2026'!$A$16:$G$161,3,FALSE))","v":"Zumofen / Gattlen"},{"$f":"VLOOKUP(D288,'2026'!$A$16:$B$161,2,FALSE)","v":"Xea"},85,77,{"$f":"VLOOKUP(E288,'2026'!$A$16:$G$161,2,FALSE)","v":"Tirana"},{"$f":"IF(ISBLANK(E288),\"hie eu nix drischribu\",VLOOKUP(E288,'2026'!$A$16:$G$161,3,FALSE))","v":"Williner Anton"}]
["2026-06-24",{"$f":"IF(ISBLANK(D289),\"Alain, nix drischribu\",VLOOKUP(D289,'2026'!$A$16:$G$161,3,FALSE))","v":"Stallung Jäger & Tscherrig"},{"$f":"VLOOKUP(D289,'2026'!$A$16:$B$161,2,FALSE)","v":"Samoa"},60,18,{"$f":"VLOOKUP(E289,'2026'!$A$16:$G$161,2,FALSE)","v":"Calina"},{"$f":"IF(ISBLANK(E289),\"hie eu nix drischribu\",VLOOKUP(E289,'2026'!$A$16:$G$161,3,FALSE))","v":"Bregy Uli, Lisi & Pascal"}]
["2026-06-24",{"$f":"IF(ISBLANK(D290),\"Alain, nix drischribu\",VLOOKUP(D290,'2026'!$A$16:$G$161,3,FALSE))","v":"Zumofen / Gattlen"},{"$f":"VLOOKUP(D290,'2026'!$A$16:$B$161,2,FALSE)","v":"Valdeeze"},88,13,{"$f":"VLOOKUP(E290,'2026'!$A$16:$G$161,2,FALSE)","v":"Cora"},{"$f":"IF(ISBLANK(E290),\"hie eu nix drischribu\",VLOOKUP(E290,'2026'!$A$16:$G$161,3,FALSE))","v":"Bregy Uli, Lisi & Pascal"}]
["2026-06-24",{"$f":"IF(ISBLANK(D291),\"Alain, nix drischribu\",VLOOKUP(D291,'2026'!$A$16:$G$161,3,FALSE))","v":"Zumofen / Gattlen"},{"$f":"VLOOKUP(D291,'2026'!$A$16:$B$161,2,FALSE)","v":"Vergara"},91,70,{"$f":"VLOOKUP(E291,'2026'!$A$16:$G$161,2,FALSE)","v":"Belle"},{"$f":"IF(ISBLANK(E291),\"hie eu nix drischribu\",VLOOKUP(E291,'2026'!$A$16:$G$161,3,FALSE))","v":"Stallung Passeraub"}]
["2026-06-24",{"$f":"IF(ISBLANK(D292),\"Alain, nix drischribu\",VLOOKUP(D292,'2026'!$A$16:$G$161,3,FALSE))","v":"Familie Leiggener"},{"$f":"VLOOKUP(D292,'2026'!$A$16:$B$161,2,FALSE)","v":"Colette"},19,90,{"$f":"VLOOKUP(E292,'2026'!$A$16:$G$161,2,FALSE)","v":"Calcuta"},{"$f":"IF(ISBLANK(E292),\"hie eu nix drischribu\",VLOOKUP(E292,'2026'!$A$16:$G$161,3,FALSE))","v":"Zumofen / Gattlen"}]
["2026-06-24",{"$f":"IF(ISBLANK(D293),\"Alain, nix drischribu\",VLOOKUP(D293,'2026'!$A$16:$G$161,3,FALSE))","v":"Hischier H. & Bühlmann J."},{"$f":"VLOOKUP(D293,'2026'!$A$16:$B$161,2,FALSE)","v":"Tara"},44,35,{"$f":"VLOOKUP(E293,'2026'!$A$16:$G$161,2,FALSE)","v":"Cartouche"},{"$f":"IF(ISBLANK(E293),\"hie eu nix drischribu\",VLOOKUP(E293,'2026'!$A$16:$G$161,3,FALSE))","v":"Geschwister Lötscher"}]
["2026-06-24",{"$f":"IF(ISBLANK(D294),\"Alain, nix drischribu\",VLOOKUP(D294,'2026'!$A$16:$G$161,3,FALSE))","v":"Zumofen / Gattlen"},{"$f":"VLOOKUP(D294,'2026'!$A$16:$B$161,2,FALSE)","v":"Vergara"},91,19,{"$f":"VLOOKUP(E294,'2026'!$A$16:$G$161,2,FALSE)","v":"Colette"},{"$f":"IF(ISBLANK(E294),\"hie eu nix drischribu\",VLOOKUP(E294,'2026'!$A$16:$G$161,3,FALSE))","v":"Familie Leiggener"}]
["2026-06-24",{"$f":"IF(ISBLANK(D295),\"Alain, nix drischribu\",VLOOKUP(D295,'2026'!$A$16:$G$161,3,FALSE))","v":"Bregy Uli, Lisi & Pascal"},{"$f":"VLOOKUP(D295,'2026'!$A$16:$B$161,2,FALSE)","v":"Perona"},10,25,{"$f":"VLOOKUP(E295,'2026'!$A$16:$G$161,2,FALSE)","v":"Tirana"},{"$f":"IF(ISBLANK(E295),\"hie eu nix drischribu\",VLOOKUP(E295,'2026'!$A$16:$G$161,3,FALSE))","v":"Gebrüder Jäger"}]
["2026-06-24",{"$f":"IF(ISBLANK(D296),\"Alain, nix drischribu\",VLOOKUP(D296,'2026'!$A$16:$G$161,3,FALSE))","v":"Bregy Uli, Lisi & Pascal"},{"$f":"VLOOKUP(D296,'2026'!$A$16:$B$161,2,FALSE)","v":"Calina"},18,78,{"$f":"VLOOKUP(E296,'2026'!$A$16:$G$161,2,FALSE)","v":"Timba"},{"$f":"IF(ISBLANK(E296),\"hie eu nix drischribu\",VLOOKUP(E296,'2026'!$A$16:$G$161,3,FALSE))","v":"Williner Anton"}]
["2026-06-24",{"$f":"IF(ISBLANK(D297),\"Alain, nix drischribu\",VLOOKUP(D297,'2026'!$A$16:$G$161,3,FALSE))","v":"Williner Anton"},{"$f":"VLOOKUP(D297,'2026'!$A$16:$B$161,2,FALSE)","v":"Timba"},78,42,{"$f":"VLOOKUP(E297,'2026'!$A$16:$G$161,2,FALSE)","v":"Alena"},{"$f":"IF(ISBLANK(E297),\"hie eu nix drischribu\",VLOOKUP(E297,'2026'!$A$16:$G$161,3,FALSE))","v":"Hischier H. & Bühlmann J."}]
["2026-06-23",{"$f":"IF(ISBLANK(D298),\"Alain, nix drischribu\",VLOOKUP(D298,'2026'!$A$16:$G$161,3,FALSE))","v":"Zumofen / Gattlen"},{"$f":"VLOOKUP(D298,'2026'!$A$16:$B$161,2,FALSE)","v":"Xea"},85,64,{"$f":"VLOOKUP(E298,'2026'!$A$16:$G$161,2,FALSE)","v":"Bonita"},{"$f":"IF(ISBLANK(E298),\"hie eu nix drischribu\",VLOOKUP(E298,'2026'!$A$16:$G$161,3,FALSE))","v":"Stallung Passeraub"}]
["2026-06-23",{"$f":"IF(ISBLANK(D299),\"Alain, nix drischribu\",VLOOKUP(D299,'2026'!$A$16:$G$161,3,FALSE))","v":"Stallung Jäger & Tscherrig"},{"$f":"VLOOKUP(D299,'2026'!$A$16:$B$161,2,FALSE)","v":"Samba"},49,80,{"$f":"VLOOKUP(E299,'2026'!$A$16:$G$161,2,FALSE)","v":"Xena"},{"$f":"IF(ISBLANK(E299),\"hie eu nix drischribu\",VLOOKUP(E299,'2026'!$A$16:$G$161,3,FALSE))","v":"Zumofen / Gattlen"}]
["2026-06-23",{"$f":"IF(ISBLANK(D300),\"Alain, nix drischribu\",VLOOKUP(D300,'2026'!$A$16:$G$161,3,FALSE))","v":"Zumofen / Gattlen"},{"$f":"VLOOKUP(D300,'2026'!$A$16:$B$161,2,FALSE)","v":"Xena"},80,49,{"$f":"VLOOKUP(E300,'2026'!$A$16:$G$161,2,FALSE)","v":"Samba"},{"$f":"IF(ISBLANK(E300),\"hie eu nix drischribu\",VLOOKUP(E300,'2026'!$A$16:$G$161,3,FALSE))","v":"Stallung Jäger & Tscherrig"}]
["2026-06-23",{"$f":"IF(ISBLANK(D301),\"Alain, nix drischribu\",VLOOKUP(D301,'2026'!$A$16:$G$161,3,FALSE))","v":"Bregy Uli, Lisi & Pascal"},{"$f":"VLOOKUP(D301,'2026'!$A$16:$B$161,2,FALSE)","v":"Panja"},17,91,{"$f":"VLOOKUP(E301,'2026'!$A$16:$G$161,2,FALSE)","v":"Vergara"},{"$f":"IF(ISBLANK(E301),\"hie eu nix drischribu\",VLOOKUP(E301,'2026'!$A$16:$G$161,3,FALSE))","v":"Zumofen / Gattlen"}]
["2026-06-23",{"$f":"IF(ISBLANK(D302),\"Alain, nix drischribu\",VLOOKUP(D302,'2026'!$A$16:$G$161,3,FALSE))","v":"Bregy Uli, Lisi & Pascal"},{"$f":"VLOOKUP(D302,'2026'!$A$16:$B$161,2,FALSE)","v":"Panja"},17,92,{"$f":"VLOOKUP(E302,'2026'!$A$16:$G$161,2,FALSE)","v":"Roseau"},{"$f":"IF(ISBLANK(E302),\"hie eu nix drischribu\",VLOOKUP(E302,'2026'!$A$16:$G$161,3,FALSE))","v":"Zumofen / Gattlen"}]
["2026-06-23",{"$f":"IF(ISBLANK(D303),\"Alain, nix drischribu\",VLOOKUP(D303,'2026'!$A$16:$G$161,3,FALSE))","v":"Bregy Uli, Lisi & Pascal"},{"$f":"VLOOKUP(D303,'2026'!$A$16:$B$161,2,FALSE)","v":"Calina"},18,78,{"$f":"VLOOKUP(E303,'2026'!$A$16:$G$161,2,FALSE)","v":"Timba"},{"$f":"IF(ISBLANK(E303),\"hie eu nix drischribu\",VLOOKUP(E303,'2026'!$A$16:$G$161,3,FALSE))","v":"Williner Anton"}]
["2026-06-23",{"$f":"IF(ISBLANK(D304),\"Alain, nix drischribu\",VLOOKUP(D304,'2026'!$A$16:$G$161,3,FALSE))","v":"Stallung Passeraub"},{"$f":"VLOOKUP(D304,'2026'!$A$16:$B$161,2,FALSE)","v":"Boriana"},67,57,{"$f":"VLOOKUP(E304,'2026'!$A$16:$G$161,2,FALSE)","v":"Bogota"},{"$f":"IF(ISBLANK(E304),\"hie eu nix drischribu\",VLOOKUP(E304,'2026'!$A$16:$G$161,3,FALSE))","v":"Stallung Jäger & Tscherrig"}]
["2026-06-23",{"$f":"IF(ISBLANK(D305),\"Alain, nix drischribu\",VLOOKUP(D305,'2026'!$A$16:$G$161,3,FALSE))","v":"Bregy Uli, Lisi & Pascal"},{"$f":"VLOOKUP(D305,'2026'!$A$16:$B$161,2,FALSE)","v":"Panja"},17,28,{"$f":"VLOOKUP(E305,'2026'!$A$16:$G$161,2,FALSE)","v":"Luna"},{"$f":"IF(ISBLANK(E305),\"hie eu nix drischribu\",VLOOKUP(E305,'2026'!$A$16:$G$161,3,FALSE))","v":"Gebrüder Jäger"}]
["2026-06-23",{"$f":"IF(ISBLANK(D306),\"Alain, nix drischribu\",VLOOKUP(D306,'2026'!$A$16:$G$161,3,FALSE))","v":"Stallung Jäger & Tscherrig"},{"$f":"VLOOKUP(D306,'2026'!$A$16:$B$161,2,FALSE)","v":"Pinga"},54,29,{"$f":"VLOOKUP(E306,'2026'!$A$16:$G$161,2,FALSE)","v":"Tequila"},{"$f":"IF(ISBLANK(E306),\"hie eu nix drischribu\",VLOOKUP(E306,'2026'!$A$16:$G$161,3,FALSE))","v":"Gebrüder Jäger"}]
["2026-06-23",{"$f":"IF(ISBLANK(D307),\"Alain, nix drischribu\",VLOOKUP(D307,'2026'!$A$16:$G$161,3,FALSE))","v":"Zumofen / Gattlen"},{"$f":"VLOOKUP(D307,'2026'!$A$16:$B$161,2,FALSE)","v":"Vergara"},91,11,{"$f":"VLOOKUP(E307,'2026'!$A$16:$G$161,2,FALSE)","v":"Tirana"},{"$f":"IF(ISBLANK(E307),\"hie eu nix drischribu\",VLOOKUP(E307,'2026'!$A$16:$G$161,3,FALSE))","v":"Bregy Uli, Lisi & Pascal"}]
["2026-06-23",{"$f":"IF(ISBLANK(D308),\"Alain, nix drischribu\",VLOOKUP(D308,'2026'!$A$16:$G$161,3,FALSE))","v":"Hutter Richard"},{"$f":"VLOOKUP(D308,'2026'!$A$16:$B$161,2,FALSE)","v":"Fiona"},71,1,{"$f":"VLOOKUP(E308,'2026'!$A$16:$G$161,2,FALSE)","v":"Vaya"},{"$f":"IF(ISBLANK(E308),\"hie eu nix drischribu\",VLOOKUP(E308,'2026'!$A$16:$G$161,3,FALSE))","v":"Bayard Jan"}]
["2026-06-23",{"$f":"IF(ISBLANK(D309),\"Alain, nix drischribu\",VLOOKUP(D309,'2026'!$A$16:$G$161,3,FALSE))","v":"Lauber Noah & Jonas"},{"$f":"VLOOKUP(D309,'2026'!$A$16:$B$161,2,FALSE)","v":"Ramona"},47,16,{"$f":"VLOOKUP(E309,'2026'!$A$16:$G$161,2,FALSE)","v":"Belle"},{"$f":"IF(ISBLANK(E309),\"hie eu nix drischribu\",VLOOKUP(E309,'2026'!$A$16:$G$161,3,FALSE))","v":"Bregy Uli, Lisi & Pascal"}]
["2026-06-23",{"$f":"IF(ISBLANK(D310),\"Alain, nix drischribu\",VLOOKUP(D310,'2026'!$A$16:$G$161,3,FALSE))","v":"Bregy Uli, Lisi & Pascal"},{"$f":"VLOOKUP(D310,'2026'!$A$16:$B$161,2,FALSE)","v":"Calina"},18,47,{"$f":"VLOOKUP(E310,'2026'!$A$16:$G$161,2,FALSE)","v":"Ramona"},{"$f":"IF(ISBLANK(E310),\"hie eu nix drischribu\",VLOOKUP(E310,'2026'!$A$16:$G$161,3,FALSE))","v":"Lauber Noah & Jonas"}]
["2026-06-23",{"$f":"IF(ISBLANK(D311),\"Alain, nix drischribu\",VLOOKUP(D311,'2026'!$A$16:$G$161,3,FALSE))","v":"Stallung Jäger & Tscherrig"},{"$f":"VLOOKUP(D311,'2026'!$A$16:$B$161,2,FALSE)","v":"Samba"},49,93,{"$f":"VLOOKUP(E311,'2026'!$A$16:$G$161,2,FALSE)","v":"Farinelle"},{"$f":"IF(ISBLANK(E311),\"hie eu nix drischribu\",VLOOKUP(E311,'2026'!$A$16:$G$161,3,FALSE))","v":"Zumofen / Gattlen"}]
["2026-06-23",{"$f":"IF(ISBLANK(D312),\"Alain, nix drischribu\",VLOOKUP(D312,'2026'!$A$16:$G$161,3,FALSE))","v":"Familie Leiggener"},{"$f":"VLOOKUP(D312,'2026'!$A$16:$B$161,2,FALSE)","v":"Colette"},19,93,{"$f":"VLOOKUP(E312,'2026'!$A$16:$G$161,2,FALSE)","v":"Farinelle"},{"$f":"IF(ISBLANK(E312),\"hie eu nix drischribu\",VLOOKUP(E312,'2026'!$A$16:$G$161,3,FALSE))","v":"Zumofen / Gattlen"}]
["2026-06-23",{"$f":"IF(ISBLANK(D313),\"Alain, nix drischribu\",VLOOKUP(D313,'2026'!$A$16:$G$161,3,FALSE))","v":"Stallung Passeraub"},{"$f":"VLOOKUP(D313,'2026'!$A$16:$B$161,2,FALSE)","v":"Malice"},73,61,{"$f":"VLOOKUP(E313,'2026'!$A$16:$G$161,2,FALSE)","v":"Puma"},{"$f":"IF(ISBLANK(E313),\"hie eu nix drischribu\",VLOOKUP(E313,'2026'!$A$16:$G$161,3,FALSE))","v":"Stallung Jäger & Tscherrig"}]
["2026-06-23",{"$f":"IF(ISBLANK(D314),\"Alain, nix drischribu\",VLOOKUP(D314,'2026'!$A$16:$G$161,3,FALSE))","v":"Familie Leiggener"},{"$f":"VLOOKUP(D314,'2026'!$A$16:$B$161,2,FALSE)","v":"Royale"},21,89,{"$f":"VLOOKUP(E314,'2026'!$A$16:$G$161,2,FALSE)","v":"Verygood"},{"$f":"IF(ISBLANK(E314),\"hie eu nix drischribu\",VLOOKUP(E314,'2026'!$A$16:$G$161,3,FALSE))","v":"Zumofen / Gattlen"}]
["2026-06-23",{"$f":"IF(ISBLANK(D315),\"Alain, nix drischribu\",VLOOKUP(D315,'2026'!$A$16:$G$161,3,FALSE))","v":"Bregy Uli, Lisi & Pascal"},{"$f":"VLOOKUP(D315,'2026'!$A$16:$B$161,2,FALSE)","v":"Cara"},12,25,{"$f":"VLOOKUP(E315,'2026'!$A$16:$G$161,2,FALSE)","v":"Tirana"},{"$f":"IF(ISBLANK(E315),\"hie eu nix drischribu\",VLOOKUP(E315,'2026'!$A$16:$G$161,3,FALSE))","v":"Gebrüder Jäger"}]
["2026-06-23",{"$f":"IF(ISBLANK(D316),\"Alain, nix drischribu\",VLOOKUP(D316,'2026'!$A$16:$G$161,3,FALSE))","v":"Stallung Jäger & Tscherrig"},{"$f":"VLOOKUP(D316,'2026'!$A$16:$B$161,2,FALSE)","v":"Myla"},55,27,{"$f":"VLOOKUP(E316,'2026'!$A$16:$G$161,2,FALSE)","v":"Silene"},{"$f":"IF(ISBLANK(E316),\"hie eu nix drischribu\",VLOOKUP(E316,'2026'!$A$16:$G$161,3,FALSE))","v":"Gebrüder Jäger"}]
["2026-06-23",{"$f":"IF(ISBLANK(D317),\"Alain, nix drischribu\",VLOOKUP(D317,'2026'!$A$16:$G$161,3,FALSE))","v":"Zumofen / Gattlen"},{"$f":"VLOOKUP(D317,'2026'!$A$16:$B$161,2,FALSE)","v":"Roquette"},86,85,{"$f":"VLOOKUP(E317,'2026'!$A$16:$G$161,2,FALSE)","v":"Xea"},{"$f":"IF(ISBLANK(E317),\"hie eu nix drischribu\",VLOOKUP(E317,'2026'!$A$16:$G$161,3,FALSE))","v":"Zumofen / Gattlen"}]
["2026-06-23",{"$f":"IF(ISBLANK(D318),\"Alain, nix drischribu\",VLOOKUP(D318,'2026'!$A$16:$G$161,3,FALSE))","v":"Stallung Mussmann"},{"$f":"VLOOKUP(D318,'2026'!$A$16:$B$161,2,FALSE)","v":"Mistral"},63,3,{"$f":"VLOOKUP(E318,'2026'!$A$16:$G$161,2,FALSE)","v":"Pegasus"},{"$f":"IF(ISBLANK(E318),\"hie eu nix drischribu\",VLOOKUP(E318,'2026'!$A$16:$G$161,3,FALSE))","v":"Bayard Medard & Gustav"}]
["2026-06-22",{"$f":"IF(ISBLANK(D319),\"Alain, nix drischribu\",VLOOKUP(D319,'2026'!$A$16:$G$161,3,FALSE))","v":"Zumofen / Gattlen"},{"$f":"VLOOKUP(D319,'2026'!$A$16:$B$161,2,FALSE)","v":"Rena"},82,52,{"$f":"VLOOKUP(E319,'2026'!$A$16:$G$161,2,FALSE)","v":"Santana"},{"$f":"IF(ISBLANK(E319),\"hie eu nix drischribu\",VLOOKUP(E319,'2026'!$A$16:$G$161,3,FALSE))","v":"Stallung Jäger & Tscherrig"}]
["2026-06-22",{"$f":"IF(ISBLANK(D320),\"Alain, nix drischribu\",VLOOKUP(D320,'2026'!$A$16:$G$161,3,FALSE))","v":"Zumofen / Gattlen"},{"$f":"VLOOKUP(D320,'2026'!$A$16:$B$161,2,FALSE)","v":"Farinelle"},93,29,{"$f":"VLOOKUP(E320,'2026'!$A$16:$G$161,2,FALSE)","v":"Tequila"},{"$f":"IF(ISBLANK(E320),\"hie eu nix drischribu\",VLOOKUP(E320,'2026'!$A$16:$G$161,3,FALSE))","v":"Gebrüder Jäger"}]
["2026-06-22",{"$f":"IF(ISBLANK(D321),\"Alain, nix drischribu\",VLOOKUP(D321,'2026'!$A$16:$G$161,3,FALSE))","v":"Stallung Passeraub"},{"$f":"VLOOKUP(D321,'2026'!$A$16:$B$161,2,FALSE)","v":"Malice"},73,21,{"$f":"VLOOKUP(E321,'2026'!$A$16:$G$161,2,FALSE)","v":"Royale"},{"$f":"IF(ISBLANK(E321),\"hie eu nix drischribu\",VLOOKUP(E321,'2026'!$A$16:$G$161,3,FALSE))","v":"Familie Leiggener"}]
["2026-06-22",{"$f":"IF(ISBLANK(D322),\"Alain, nix drischribu\",VLOOKUP(D322,'2026'!$A$16:$G$161,3,FALSE))","v":"Bayard Medard & Gustav"},{"$f":"VLOOKUP(D322,'2026'!$A$16:$B$161,2,FALSE)","v":"Mamba"},2,18,{"$f":"VLOOKUP(E322,'2026'!$A$16:$G$161,2,FALSE)","v":"Calina"},{"$f":"IF(ISBLANK(E322),\"hie eu nix drischribu\",VLOOKUP(E322,'2026'!$A$16:$G$161,3,FALSE))","v":"Bregy Uli, Lisi & Pascal"}]
["2026-06-22",{"$f":"IF(ISBLANK(D323),\"Alain, nix drischribu\",VLOOKUP(D323,'2026'!$A$16:$G$161,3,FALSE))","v":"Stallung Jäger & Tscherrig"},{"$f":"VLOOKUP(D323,'2026'!$A$16:$B$161,2,FALSE)","v":"Pinga"},54,6,{"$f":"VLOOKUP(E323,'2026'!$A$16:$G$161,2,FALSE)","v":"Cataille"},{"$f":"IF(ISBLANK(E323),\"hie eu nix drischribu\",VLOOKUP(E323,'2026'!$A$16:$G$161,3,FALSE))","v":"Bregy Alain"}]
["2026-06-22",{"$f":"IF(ISBLANK(D324),\"Alain, nix drischribu\",VLOOKUP(D324,'2026'!$A$16:$G$161,3,FALSE))","v":"Zumofen / Gattlen"},{"$f":"VLOOKUP(D324,'2026'!$A$16:$B$161,2,FALSE)","v":"Verygood"},89,10,{"$f":"VLOOKUP(E324,'2026'!$A$16:$G$161,2,FALSE)","v":"Perona"},{"$f":"IF(ISBLANK(E324),\"hie eu nix drischribu\",VLOOKUP(E324,'2026'!$A$16:$G$161,3,FALSE))","v":"Bregy Uli, Lisi & Pascal"}]
["2026-06-22",{"$f":"IF(ISBLANK(D325),\"Alain, nix drischribu\",VLOOKUP(D325,'2026'!$A$16:$G$161,3,FALSE))","v":"Stallung Passeraub"},{"$f":"VLOOKUP(D325,'2026'!$A$16:$B$161,2,FALSE)","v":"Malice"},73,22,{"$f":"VLOOKUP(E325,'2026'!$A$16:$G$161,2,FALSE)","v":"Tyson"},{"$f":"IF(ISBLANK(E325),\"hie eu nix drischribu\",VLOOKUP(E325,'2026'!$A$16:$G$161,3,FALSE))","v":"Familie Leiggener"}]
["2026-06-22",{"$f":"IF(ISBLANK(D326),\"Alain, nix drischribu\",VLOOKUP(D326,'2026'!$A$16:$G$161,3,FALSE))","v":"Lauber Noah & Jonas"},{"$f":"VLOOKUP(D326,'2026'!$A$16:$B$161,2,FALSE)","v":"Ramona"},47,72,{"$f":"VLOOKUP(E326,'2026'!$A$16:$G$161,2,FALSE)","v":"Poseidon"},{"$f":"IF(ISBLANK(E326),\"hie eu nix drischribu\",VLOOKUP(E326,'2026'!$A$16:$G$161,3,FALSE))","v":"Hutter Richard"}]
["2026-06-22",{"$f":"IF(ISBLANK(D327),\"Alain, nix drischribu\",VLOOKUP(D327,'2026'!$A$16:$G$161,3,FALSE))","v":"Bregy Uli, Lisi & Pascal"},{"$f":"VLOOKUP(D327,'2026'!$A$16:$B$161,2,FALSE)","v":"Cara"},12,47,{"$f":"VLOOKUP(E327,'2026'!$A$16:$G$161,2,FALSE)","v":"Ramona"},{"$f":"IF(ISBLANK(E327),\"hie eu nix drischribu\",VLOOKUP(E327,'2026'!$A$16:$G$161,3,FALSE))","v":"Lauber Noah & Jonas"}]
["2026-06-22",{"$f":"IF(ISBLANK(D328),\"Alain, nix drischribu\",VLOOKUP(D328,'2026'!$A$16:$G$161,3,FALSE))","v":"Bayard Jan"},{"$f":"VLOOKUP(D328,'2026'!$A$16:$B$161,2,FALSE)","v":"Vaya"},1,25,{"$f":"VLOOKUP(E328,'2026'!$A$16:$G$161,2,FALSE)","v":"Tirana"},{"$f":"IF(ISBLANK(E328),\"hie eu nix drischribu\",VLOOKUP(E328,'2026'!$A$16:$G$161,3,FALSE))","v":"Gebrüder Jäger"}]
["2026-06-22",{"$f":"IF(ISBLANK(D329),\"Alain, nix drischribu\",VLOOKUP(D329,'2026'!$A$16:$G$161,3,FALSE))","v":"Bregy Uli, Lisi & Pascal"},{"$f":"VLOOKUP(D329,'2026'!$A$16:$B$161,2,FALSE)","v":"Perona"},10,63,{"$f":"VLOOKUP(E329,'2026'!$A$16:$G$161,2,FALSE)","v":"Mistral"},{"$f":"IF(ISBLANK(E329),\"hie eu nix drischribu\",VLOOKUP(E329,'2026'!$A$16:$G$161,3,FALSE))","v":"Stallung Mussmann"}]
["2026-06-22",{"$f":"IF(ISBLANK(D330),\"Alain, nix drischribu\",VLOOKUP(D330,'2026'!$A$16:$G$161,3,FALSE))","v":"Zumofen / Gattlen"},{"$f":"VLOOKUP(D330,'2026'!$A$16:$B$161,2,FALSE)","v":"Farinelle"},93,78,{"$f":"VLOOKUP(E330,'2026'!$A$16:$G$161,2,FALSE)","v":"Timba"},{"$f":"IF(ISBLANK(E330),\"hie eu nix drischribu\",VLOOKUP(E330,'2026'!$A$16:$G$161,3,FALSE))","v":"Williner Anton"}]
["2026-06-22",{"$f":"IF(ISBLANK(D331),\"Alain, nix drischribu\",VLOOKUP(D331,'2026'!$A$16:$G$161,3,FALSE))","v":"Gebrüder Jäger"},{"$f":"VLOOKUP(D331,'2026'!$A$16:$B$161,2,FALSE)","v":"Betty Boop"},26,79,{"$f":"VLOOKUP(E331,'2026'!$A$16:$G$161,2,FALSE)","v":"Dorin"},{"$f":"IF(ISBLANK(E331),\"hie eu nix drischribu\",VLOOKUP(E331,'2026'!$A$16:$G$161,3,FALSE))","v":"Williner Anton"}]
["2026-06-22",{"$f":"IF(ISBLANK(D332),\"Alain, nix drischribu\",VLOOKUP(D332,'2026'!$A$16:$G$161,3,FALSE))","v":"Stallung Jäger & Tscherrig"},{"$f":"VLOOKUP(D332,'2026'!$A$16:$B$161,2,FALSE)","v":"Puma"},61,93,{"$f":"VLOOKUP(E332,'2026'!$A$16:$G$161,2,FALSE)","v":"Farinelle"},{"$f":"IF(ISBLANK(E332),\"hie eu nix drischribu\",VLOOKUP(E332,'2026'!$A$16:$G$161,3,FALSE))","v":"Zumofen / Gattlen"}]
["2026-06-22",{"$f":"IF(ISBLANK(D333),\"Alain, nix drischribu\",VLOOKUP(D333,'2026'!$A$16:$G$161,3,FALSE))","v":"Bayard Medard & Gustav"},{"$f":"VLOOKUP(D333,'2026'!$A$16:$B$161,2,FALSE)","v":"Vampir"},4,76,{"$f":"VLOOKUP(E333,'2026'!$A$16:$G$161,2,FALSE)","v":"Venus"},{"$f":"IF(ISBLANK(E333),\"hie eu nix drischribu\",VLOOKUP(E333,'2026'!$A$16:$G$161,3,FALSE))","v":"Williner Anton"}]
["2026-06-22",{"$f":"IF(ISBLANK(D334),\"Alain, nix drischribu\",VLOOKUP(D334,'2026'!$A$16:$G$161,3,FALSE))","v":"Bayard Medard & Gustav"},{"$f":"VLOOKUP(D334,'2026'!$A$16:$B$161,2,FALSE)","v":"Valerie"},5,13,{"$f":"VLOOKUP(E334,'2026'!$A$16:$G$161,2,FALSE)","v":"Cora"},{"$f":"IF(ISBLANK(E334),\"hie eu nix drischribu\",VLOOKUP(E334,'2026'!$A$16:$G$161,3,FALSE))","v":"Bregy Uli, Lisi & Pascal"}]
["2026-06-22",{"$f":"IF(ISBLANK(D335),\"Alain, nix drischribu\",VLOOKUP(D335,'2026'!$A$16:$G$161,3,FALSE))","v":"Stallung Passeraub"},{"$f":"VLOOKUP(D335,'2026'!$A$16:$B$161,2,FALSE)","v":"Malice"},73,19,{"$f":"VLOOKUP(E335,'2026'!$A$16:$G$161,2,FALSE)","v":"Colette"},{"$f":"IF(ISBLANK(E335),\"hie eu nix drischribu\",VLOOKUP(E335,'2026'!$A$16:$G$161,3,FALSE))","v":"Familie Leiggener"}]
["2026-06-22",{"$f":"IF(ISBLANK(D336),\"Alain, nix drischribu\",VLOOKUP(D336,'2026'!$A$16:$G$161,3,FALSE))","v":"Stallung Jäger & Tscherrig"},{"$f":"VLOOKUP(D336,'2026'!$A$16:$B$161,2,FALSE)","v":"Pinga"},54,88,{"$f":"VLOOKUP(E336,'2026'!$A$16:$G$161,2,FALSE)","v":"Valdeeze"},{"$f":"IF(ISBLANK(E336),\"hie eu nix drischribu\",VLOOKUP(E336,'2026'!$A$16:$G$161,3,FALSE))","v":"Zumofen / Gattlen"}]
["2026-06-22",{"$f":"IF(ISBLANK(D337),\"Alain, nix drischribu\",VLOOKUP(D337,'2026'!$A$16:$G$161,3,FALSE))","v":"Bregy Alain"},{"$f":"VLOOKUP(D337,'2026'!$A$16:$B$161,2,FALSE)","v":"Bilbao"},7,93,{"$f":"VLOOKUP(E337,'2026'!$A$16:$G$161,2,FALSE)","v":"Farinelle"},{"$f":"IF(ISBLANK(E337),\"hie eu nix drischribu\",VLOOKUP(E337,'2026'!$A$16:$G$161,3,FALSE))","v":"Zumofen / Gattlen"}]
["2026-06-22",{"$f":"IF(ISBLANK(D338),\"Alain, nix drischribu\",VLOOKUP(D338,'2026'!$A$16:$G$161,3,FALSE))","v":"Zumofen / Gattlen"},{"$f":"VLOOKUP(D338,'2026'!$A$16:$B$161,2,FALSE)","v":"Souris"},81,65,{"$f":"VLOOKUP(E338,'2026'!$A$16:$G$161,2,FALSE)","v":"Belana"},{"$f":"IF(ISBLANK(E338),\"hie eu nix drischribu\",VLOOKUP(E338,'2026'!$A$16:$G$161,3,FALSE))","v":"Stallung Passeraub"}]
["2026-06-22",{"$f":"IF(ISBLANK(D339),\"Alain, nix drischribu\",VLOOKUP(D339,'2026'!$A$16:$G$161,3,FALSE))","v":"Bregy Uli, Lisi & Pascal"},{"$f":"VLOOKUP(D339,'2026'!$A$16:$B$161,2,FALSE)","v":"Perona"},10,60,{"$f":"VLOOKUP(E339,'2026'!$A$16:$G$161,2,FALSE)","v":"Samoa"},{"$f":"IF(ISBLANK(E339),\"hie eu nix drischribu\",VLOOKUP(E339,'2026'!$A$16:$G$161,3,FALSE))","v":"Stallung Jäger & Tscherrig"}]
["2026-06-22",{"$f":"IF(ISBLANK(D340),\"Alain, nix drischribu\",VLOOKUP(D340,'2026'!$A$16:$G$161,3,FALSE))","v":"Zumofen / Gattlen"},{"$f":"VLOOKUP(D340,'2026'!$A$16:$B$161,2,FALSE)","v":"Vergara"},91,8,{"$f":"VLOOKUP(E340,'2026'!$A$16:$G$161,2,FALSE)","v":"Valesia"},{"$f":"IF(ISBLANK(E340),\"hie eu nix drischribu\",VLOOKUP(E340,'2026'!$A$16:$G$161,3,FALSE))","v":"Bregy Alain"}]
["2026-06-22",{"$f":"IF(ISBLANK(D341),\"Alain, nix drischribu\",VLOOKUP(D341,'2026'!$A$16:$G$161,3,FALSE))","v":"Zumofen / Gattlen"},{"$f":"VLOOKUP(D341,'2026'!$A$16:$B$161,2,FALSE)","v":"Farinelle"},93,38,{"$f":"VLOOKUP(E341,'2026'!$A$16:$G$161,2,FALSE)","v":"Casimir"},{"$f":"IF(ISBLANK(E341),\"hie eu nix drischribu\",VLOOKUP(E341,'2026'!$A$16:$G$161,3,FALSE))","v":"Geschwister Lötscher"}]
["2026-06-22",{"$f":"IF(ISBLANK(D342),\"Alain, nix drischribu\",VLOOKUP(D342,'2026'!$A$16:$G$161,3,FALSE))","v":"Bregy Uli, Lisi & Pascal"},{"$f":"VLOOKUP(D342,'2026'!$A$16:$B$161,2,FALSE)","v":"Perona"},10,47,{"$f":"VLOOKUP(E342,'2026'!$A$16:$G$161,2,FALSE)","v":"Ramona"},{"$f":"IF(ISBLANK(E342),\"hie eu nix drischribu\",VLOOKUP(E342,'2026'!$A$16:$G$161,3,FALSE))","v":"Lauber Noah & Jonas"}]
["2026-06-22",{"$f":"IF(ISBLANK(D343),\"Alain, nix drischribu\",VLOOKUP(D343,'2026'!$A$16:$G$161,3,FALSE))","v":"Zumofen / Gattlen"},{"$f":"VLOOKUP(D343,'2026'!$A$16:$B$161,2,FALSE)","v":"Verygood"},89,57,{"$f":"VLOOKUP(E343,'2026'!$A$16:$G$161,2,FALSE)","v":"Bogota"},{"$f":"IF(ISBLANK(E343),\"hie eu nix drischribu\",VLOOKUP(E343,'2026'!$A$16:$G$161,3,FALSE))","v":"Stallung Jäger & Tscherrig"}]
["2026-06-22",{"$f":"IF(ISBLANK(D344),\"Alain, nix drischribu\",VLOOKUP(D344,'2026'!$A$16:$G$161,3,FALSE))","v":"Bregy Uli, Lisi & Pascal"},{"$f":"VLOOKUP(D344,'2026'!$A$16:$B$161,2,FALSE)","v":"Perona"},10,5,{"$f":"VLOOKUP(E344,'2026'!$A$16:$G$161,2,FALSE)","v":"Valerie"},{"$f":"IF(ISBLANK(E344),\"hie eu nix drischribu\",VLOOKUP(E344,'2026'!$A$16:$G$161,3,FALSE))","v":"Bayard Medard & Gustav"}]
["2026-06-22",{"$f":"IF(ISBLANK(D345),\"Alain, nix drischribu\",VLOOKUP(D345,'2026'!$A$16:$G$161,3,FALSE))","v":"Bayard Medard & Gustav"},{"$f":"VLOOKUP(D345,'2026'!$A$16:$B$161,2,FALSE)","v":"Mamba"},2,92,{"$f":"VLOOKUP(E345,'2026'!$A$16:$G$161,2,FALSE)","v":"Roseau"},{"$f":"IF(ISBLANK(E345),\"hie eu nix drischribu\",VLOOKUP(E345,'2026'!$A$16:$G$161,3,FALSE))","v":"Zumofen / Gattlen"}]
["2026-06-22",{"$f":"IF(ISBLANK(D346),\"Alain, nix drischribu\",VLOOKUP(D346,'2026'!$A$16:$G$161,3,FALSE))","v":"Bayard Medard & Gustav"},{"$f":"VLOOKUP(D346,'2026'!$A$16:$B$161,2,FALSE)","v":"Mamba"},2,10,{"$f":"VLOOKUP(E346,'2026'!$A$16:$G$161,2,FALSE)","v":"Perona"},{"$f":"IF(ISBLANK(E346),\"hie eu nix drischribu\",VLOOKUP(E346,'2026'!$A$16:$G$161,3,FALSE))","v":"Bregy Uli, Lisi & Pascal"}]
["2026-06-22",{"$f":"IF(ISBLANK(D347),\"Alain, nix drischribu\",VLOOKUP(D347,'2026'!$A$16:$G$161,3,FALSE))","v":"Williner Anton"},{"$f":"VLOOKUP(D347,'2026'!$A$16:$B$161,2,FALSE)","v":"Venus"},76,24,{"$f":"VLOOKUP(E347,'2026'!$A$16:$G$161,2,FALSE)","v":"Tamara"},{"$f":"IF(ISBLANK(E347),\"hie eu nix drischribu\",VLOOKUP(E347,'2026'!$A$16:$G$161,3,FALSE))","v":"Gebrüder Jäger"}]
["2026-06-21",{"$f":"IF(ISBLANK(D348),\"Alain, nix drischribu\",VLOOKUP(D348,'2026'!$A$16:$G$161,3,FALSE))","v":"Bayard Jan"},{"$f":"VLOOKUP(D348,'2026'!$A$16:$B$161,2,FALSE)","v":"Vaya"},1,56,{"$f":"VLOOKUP(E348,'2026'!$A$16:$G$161,2,FALSE)","v":"Fanny"},{"$f":"IF(ISBLANK(E348),\"hie eu nix drischribu\",VLOOKUP(E348,'2026'!$A$16:$G$161,3,FALSE))","v":"Stallung Jäger & Tscherrig"}]
["2026-06-21",{"$f":"IF(ISBLANK(D349),\"Alain, nix drischribu\",VLOOKUP(D349,'2026'!$A$16:$G$161,3,FALSE))","v":"Stallung Jäger & Tscherrig"},{"$f":"VLOOKUP(D349,'2026'!$A$16:$B$161,2,FALSE)","v":"Myla"},55,6,{"$f":"VLOOKUP(E349,'2026'!$A$16:$G$161,2,FALSE)","v":"Cataille"},{"$f":"IF(ISBLANK(E349),\"hie eu nix drischribu\",VLOOKUP(E349,'2026'!$A$16:$G$161,3,FALSE))","v":"Bregy Alain"}]
["2026-06-21",{"$f":"IF(ISBLANK(D350),\"Alain, nix drischribu\",VLOOKUP(D350,'2026'!$A$16:$G$161,3,FALSE))","v":"Stallung Jäger & Tscherrig"},{"$f":"VLOOKUP(D350,'2026'!$A$16:$B$161,2,FALSE)","v":"Myla"},55,7,{"$f":"VLOOKUP(E350,'2026'!$A$16:$G$161,2,FALSE)","v":"Bilbao"},{"$f":"IF(ISBLANK(E350),\"hie eu nix drischribu\",VLOOKUP(E350,'2026'!$A$16:$G$161,3,FALSE))","v":"Bregy Alain"}]
["2026-06-21",{"$f":"IF(ISBLANK(D351),\"Alain, nix drischribu\",VLOOKUP(D351,'2026'!$A$16:$G$161,3,FALSE))","v":"Bregy Uli, Lisi & Pascal"},{"$f":"VLOOKUP(D351,'2026'!$A$16:$B$161,2,FALSE)","v":"Cara"},12,78,{"$f":"VLOOKUP(E351,'2026'!$A$16:$G$161,2,FALSE)","v":"Timba"},{"$f":"IF(ISBLANK(E351),\"hie eu nix drischribu\",VLOOKUP(E351,'2026'!$A$16:$G$161,3,FALSE))","v":"Williner Anton"}]
["2026-06-21",{"$f":"IF(ISBLANK(D352),\"Alain, nix drischribu\",VLOOKUP(D352,'2026'!$A$16:$G$161,3,FALSE))","v":"Bregy Uli, Lisi & Pascal"},{"$f":"VLOOKUP(D352,'2026'!$A$16:$B$161,2,FALSE)","v":"Cara"},12,79,{"$f":"VLOOKUP(E352,'2026'!$A$16:$G$161,2,FALSE)","v":"Dorin"},{"$f":"IF(ISBLANK(E352),\"hie eu nix drischribu\",VLOOKUP(E352,'2026'!$A$16:$G$161,3,FALSE))","v":"Williner Anton"}]
["2026-06-21",{"$f":"IF(ISBLANK(D353),\"Alain, nix drischribu\",VLOOKUP(D353,'2026'!$A$16:$G$161,3,FALSE))","v":"Bayard Medard & Gustav"},{"$f":"VLOOKUP(D353,'2026'!$A$16:$B$161,2,FALSE)","v":"Pegasus"},3,31,{"$f":"VLOOKUP(E353,'2026'!$A$16:$G$161,2,FALSE)","v":"Santana"},{"$f":"IF(ISBLANK(E353),\"hie eu nix drischribu\",VLOOKUP(E353,'2026'!$A$16:$G$161,3,FALSE))","v":"Gebrüder Jäger"}]
["2026-06-21",{"$f":"IF(ISBLANK(D354),\"Alain, nix drischribu\",VLOOKUP(D354,'2026'!$A$16:$G$161,3,FALSE))","v":"Gebrüder Jäger"},{"$f":"VLOOKUP(D354,'2026'!$A$16:$B$161,2,FALSE)","v":"Betty Boop"},26,7,{"$f":"VLOOKUP(E354,'2026'!$A$16:$G$161,2,FALSE)","v":"Bilbao"},{"$f":"IF(ISBLANK(E354),\"hie eu nix drischribu\",VLOOKUP(E354,'2026'!$A$16:$G$161,3,FALSE))","v":"Bregy Alain"}]
["2026-06-21",{"$f":"IF(ISBLANK(D355),\"Alain, nix drischribu\",VLOOKUP(D355,'2026'!$A$16:$G$161,3,FALSE))","v":"Stallung Mussmann"},{"$f":"VLOOKUP(D355,'2026'!$A$16:$B$161,2,FALSE)","v":"Mistral"},63,40,{"$f":"VLOOKUP(E355,'2026'!$A$16:$G$161,2,FALSE)","v":"Pandora"},{"$f":"IF(ISBLANK(E355),\"hie eu nix drischribu\",VLOOKUP(E355,'2026'!$A$16:$G$161,3,FALSE))","v":"Lötscher Sandrine & Cédric"}]
["2026-06-21",{"$f":"IF(ISBLANK(D356),\"Alain, nix drischribu\",VLOOKUP(D356,'2026'!$A$16:$G$161,3,FALSE))","v":"Stallung Jäger & Tscherrig"},{"$f":"VLOOKUP(D356,'2026'!$A$16:$B$161,2,FALSE)","v":"Metis"},48,69,{"$f":"VLOOKUP(E356,'2026'!$A$16:$G$161,2,FALSE)","v":"Bandera"},{"$f":"IF(ISBLANK(E356),\"hie eu nix drischribu\",VLOOKUP(E356,'2026'!$A$16:$G$161,3,FALSE))","v":"Stallung Passeraub"}]
["2026-06-21",{"$f":"IF(ISBLANK(D357),\"Alain, nix drischribu\",VLOOKUP(D357,'2026'!$A$16:$G$161,3,FALSE))","v":"Stallung Passeraub"},{"$f":"VLOOKUP(D357,'2026'!$A$16:$B$161,2,FALSE)","v":"Malice"},73,8,{"$f":"VLOOKUP(E357,'2026'!$A$16:$G$161,2,FALSE)","v":"Valesia"},{"$f":"IF(ISBLANK(E357),\"hie eu nix drischribu\",VLOOKUP(E357,'2026'!$A$16:$G$161,3,FALSE))","v":"Bregy Alain"}]
["2026-06-21",{"$f":"IF(ISBLANK(D358),\"Alain, nix drischribu\",VLOOKUP(D358,'2026'!$A$16:$G$161,3,FALSE))","v":"Bayard Medard & Gustav"},{"$f":"VLOOKUP(D358,'2026'!$A$16:$B$161,2,FALSE)","v":"Mamba"},2,60,{"$f":"VLOOKUP(E358,'2026'!$A$16:$G$161,2,FALSE)","v":"Samoa"},{"$f":"IF(ISBLANK(E358),\"hie eu nix drischribu\",VLOOKUP(E358,'2026'!$A$16:$G$161,3,FALSE))","v":"Stallung Jäger & Tscherrig"}]
["2026-06-21",{"$f":"IF(ISBLANK(D359),\"Alain, nix drischribu\",VLOOKUP(D359,'2026'!$A$16:$G$161,3,FALSE))","v":"Gebrüder Jäger"},{"$f":"VLOOKUP(D359,'2026'!$A$16:$B$161,2,FALSE)","v":"Luna"},28,42,{"$f":"VLOOKUP(E359,'2026'!$A$16:$G$161,2,FALSE)","v":"Alena"},{"$f":"IF(ISBLANK(E359),\"hie eu nix drischribu\",VLOOKUP(E359,'2026'!$A$16:$G$161,3,FALSE))","v":"Hischier H. & Bühlmann J."}]
["2026-06-21",{"$f":"IF(ISBLANK(D360),\"Alain, nix drischribu\",VLOOKUP(D360,'2026'!$A$16:$G$161,3,FALSE))","v":"Familie Leiggener"},{"$f":"VLOOKUP(D360,'2026'!$A$16:$B$161,2,FALSE)","v":"Royale"},21,55,{"$f":"VLOOKUP(E360,'2026'!$A$16:$G$161,2,FALSE)","v":"Myla"},{"$f":"IF(ISBLANK(E360),\"hie eu nix drischribu\",VLOOKUP(E360,'2026'!$A$16:$G$161,3,FALSE))","v":"Stallung Jäger & Tscherrig"}]
["2026-06-21",{"$f":"IF(ISBLANK(D361),\"Alain, nix drischribu\",VLOOKUP(D361,'2026'!$A$16:$G$161,3,FALSE))","v":"Stallung Jäger & Tscherrig"},{"$f":"VLOOKUP(D361,'2026'!$A$16:$B$161,2,FALSE)","v":"Pixel"},58,20,{"$f":"VLOOKUP(E361,'2026'!$A$16:$G$161,2,FALSE)","v":"Tirana"},{"$f":"IF(ISBLANK(E361),\"hie eu nix drischribu\",VLOOKUP(E361,'2026'!$A$16:$G$161,3,FALSE))","v":"Familie Leiggener"}]
["2026-06-21",{"$f":"IF(ISBLANK(D362),\"Alain, nix drischribu\",VLOOKUP(D362,'2026'!$A$16:$G$161,3,FALSE))","v":"Williner Anton"},{"$f":"VLOOKUP(D362,'2026'!$A$16:$B$161,2,FALSE)","v":"Tirana"},77,55,{"$f":"VLOOKUP(E362,'2026'!$A$16:$G$161,2,FALSE)","v":"Myla"},{"$f":"IF(ISBLANK(E362),\"hie eu nix drischribu\",VLOOKUP(E362,'2026'!$A$16:$G$161,3,FALSE))","v":"Stallung Jäger & Tscherrig"}]
["2026-06-21",{"$f":"IF(ISBLANK(D363),\"Alain, nix drischribu\",VLOOKUP(D363,'2026'!$A$16:$G$161,3,FALSE))","v":"Gebrüder Jäger"},{"$f":"VLOOKUP(D363,'2026'!$A$16:$B$161,2,FALSE)","v":"Tamango"},30,16,{"$f":"VLOOKUP(E363,'2026'!$A$16:$G$161,2,FALSE)","v":"Belle"},{"$f":"IF(ISBLANK(E363),\"hie eu nix drischribu\",VLOOKUP(E363,'2026'!$A$16:$G$161,3,FALSE))","v":"Bregy Uli, Lisi & Pascal"}]
["2026-06-21",{"$f":"IF(ISBLANK(D364),\"Alain, nix drischribu\",VLOOKUP(D364,'2026'!$A$16:$G$161,3,FALSE))","v":"Stallung Jäger & Tscherrig"},{"$f":"VLOOKUP(D364,'2026'!$A$16:$B$161,2,FALSE)","v":"Samoa"},60,39,{"$f":"VLOOKUP(E364,'2026'!$A$16:$G$161,2,FALSE)","v":"Chips"},{"$f":"IF(ISBLANK(E364),\"hie eu nix drischribu\",VLOOKUP(E364,'2026'!$A$16:$G$161,3,FALSE))","v":"Geschwister Lötscher"}]
["2026-06-21",{"$f":"IF(ISBLANK(D365),\"Alain, nix drischribu\",VLOOKUP(D365,'2026'!$A$16:$G$161,3,FALSE))","v":"Stallung Jäger & Tscherrig"},{"$f":"VLOOKUP(D365,'2026'!$A$16:$B$161,2,FALSE)","v":"Santana"},52,91,{"$f":"VLOOKUP(E365,'2026'!$A$16:$G$161,2,FALSE)","v":"Vergara"},{"$f":"IF(ISBLANK(E365),\"hie eu nix drischribu\",VLOOKUP(E365,'2026'!$A$16:$G$161,3,FALSE))","v":"Zumofen / Gattlen"}]
["2026-06-21",{"$f":"IF(ISBLANK(D366),\"Alain, nix drischribu\",VLOOKUP(D366,'2026'!$A$16:$G$161,3,FALSE))","v":"Williner Anton"},{"$f":"VLOOKUP(D366,'2026'!$A$16:$B$161,2,FALSE)","v":"Tirana"},77,64,{"$f":"VLOOKUP(E366,'2026'!$A$16:$G$161,2,FALSE)","v":"Bonita"},{"$f":"IF(ISBLANK(E366),\"hie eu nix drischribu\",VLOOKUP(E366,'2026'!$A$16:$G$161,3,FALSE))","v":"Stallung Passeraub"}]
["2026-06-21",{"$f":"IF(ISBLANK(D367),\"Alain, nix drischribu\",VLOOKUP(D367,'2026'!$A$16:$G$161,3,FALSE))","v":"Gebrüder Jäger"},{"$f":"VLOOKUP(D367,'2026'!$A$16:$B$161,2,FALSE)","v":"Tamango"},30,79,{"$f":"VLOOKUP(E367,'2026'!$A$16:$G$161,2,FALSE)","v":"Dorin"},{"$f":"IF(ISBLANK(E367),\"hie eu nix drischribu\",VLOOKUP(E367,'2026'!$A$16:$G$161,3,FALSE))","v":"Williner Anton"}]
["2026-06-21",{"$f":"IF(ISBLANK(D368),\"Alain, nix drischribu\",VLOOKUP(D368,'2026'!$A$16:$G$161,3,FALSE))","v":"Zumofen / Gattlen"},{"$f":"VLOOKUP(D368,'2026'!$A$16:$B$161,2,FALSE)","v":"Farinelle"},93,78,{"$f":"VLOOKUP(E368,'2026'!$A$16:$G$161,2,FALSE)","v":"Timba"},{"$f":"IF(ISBLANK(E368),\"hie eu nix drischribu\",VLOOKUP(E368,'2026'!$A$16:$G$161,3,FALSE))","v":"Williner Anton"}]
["2026-06-21",{"$f":"IF(ISBLANK(D369),\"Alain, nix drischribu\",VLOOKUP(D369,'2026'!$A$16:$G$161,3,FALSE))","v":"Bregy Uli, Lisi & Pascal"},{"$f":"VLOOKUP(D369,'2026'!$A$16:$B$161,2,FALSE)","v":"Cara"},12,25,{"$f":"VLOOKUP(E369,'2026'!$A$16:$G$161,2,FALSE)","v":"Tirana"},{"$f":"IF(ISBLANK(E369),\"hie eu nix drischribu\",VLOOKUP(E369,'2026'!$A$16:$G$161,3,FALSE))","v":"Gebrüder Jäger"}]
["2026-06-20",{"$f":"IF(ISBLANK(D370),\"Alain, nix drischribu\",VLOOKUP(D370,'2026'!$A$16:$G$161,3,FALSE))","v":"Zumofen / Gattlen"},{"$f":"VLOOKUP(D370,'2026'!$A$16:$B$161,2,FALSE)","v":"Xea"},85,50,{"$f":"VLOOKUP(E370,'2026'!$A$16:$G$161,2,FALSE)","v":"Beline"},{"$f":"IF(ISBLANK(E370),\"hie eu nix drischribu\",VLOOKUP(E370,'2026'!$A$16:$G$161,3,FALSE))","v":"Stallung Jäger & Tscherrig"}]
["2026-06-20",{"$f":"IF(ISBLANK(D371),\"Alain, nix drischribu\",VLOOKUP(D371,'2026'!$A$16:$G$161,3,FALSE))","v":"Stallung Jäger & Tscherrig"},{"$f":"VLOOKUP(D371,'2026'!$A$16:$B$161,2,FALSE)","v":"Pixel"},58,26,{"$f":"VLOOKUP(E371,'2026'!$A$16:$G$161,2,FALSE)","v":"Betty Boop"},{"$f":"IF(ISBLANK(E371),\"hie eu nix drischribu\",VLOOKUP(E371,'2026'!$A$16:$G$161,3,FALSE))","v":"Gebrüder Jäger"}]
["2026-06-20",{"$f":"IF(ISBLANK(D372),\"Alain, nix drischribu\",VLOOKUP(D372,'2026'!$A$16:$G$161,3,FALSE))","v":"Zumofen / Gattlen"},{"$f":"VLOOKUP(D372,'2026'!$A$16:$B$161,2,FALSE)","v":"Vergara"},91,63,{"$f":"VLOOKUP(E372,'2026'!$A$16:$G$161,2,FALSE)","v":"Mistral"},{"$f":"IF(ISBLANK(E372),\"hie eu nix drischribu\",VLOOKUP(E372,'2026'!$A$16:$G$161,3,FALSE))","v":"Stallung Mussmann"}]
["2026-06-20",{"$f":"IF(ISBLANK(D373),\"Alain, nix drischribu\",VLOOKUP(D373,'2026'!$A$16:$G$161,3,FALSE))","v":"Bregy Uli, Lisi & Pascal"},{"$f":"VLOOKUP(D373,'2026'!$A$16:$B$161,2,FALSE)","v":"Cara"},12,30,{"$f":"VLOOKUP(E373,'2026'!$A$16:$G$161,2,FALSE)","v":"Tamango"},{"$f":"IF(ISBLANK(E373),\"hie eu nix drischribu\",VLOOKUP(E373,'2026'!$A$16:$G$161,3,FALSE))","v":"Gebrüder Jäger"}]
["2026-06-20",{"$f":"IF(ISBLANK(D374),\"Alain, nix drischribu\",VLOOKUP(D374,'2026'!$A$16:$G$161,3,FALSE))","v":"Zumofen / Gattlen"},{"$f":"VLOOKUP(D374,'2026'!$A$16:$B$161,2,FALSE)","v":"Verygood"},89,50,{"$f":"VLOOKUP(E374,'2026'!$A$16:$G$161,2,FALSE)","v":"Beline"},{"$f":"IF(ISBLANK(E374),\"hie eu nix drischribu\",VLOOKUP(E374,'2026'!$A$16:$G$161,3,FALSE))","v":"Stallung Jäger & Tscherrig"}]
["2026-06-20",{"$f":"IF(ISBLANK(D375),\"Alain, nix drischribu\",VLOOKUP(D375,'2026'!$A$16:$G$161,3,FALSE))","v":"Gebrüder Jäger"},{"$f":"VLOOKUP(D375,'2026'!$A$16:$B$161,2,FALSE)","v":"Tamango"},30,15,{"$f":"VLOOKUP(E375,'2026'!$A$16:$G$161,2,FALSE)","v":"Souma"},{"$f":"IF(ISBLANK(E375),\"hie eu nix drischribu\",VLOOKUP(E375,'2026'!$A$16:$G$161,3,FALSE))","v":"Bregy Uli, Lisi & Pascal"}]
["2026-06-20",{"$f":"IF(ISBLANK(D376),\"Alain, nix drischribu\",VLOOKUP(D376,'2026'!$A$16:$G$161,3,FALSE))","v":"Stallung Jäger & Tscherrig"},{"$f":"VLOOKUP(D376,'2026'!$A$16:$B$161,2,FALSE)","v":"Pixel"},58,18,{"$f":"VLOOKUP(E376,'2026'!$A$16:$G$161,2,FALSE)","v":"Calina"},{"$f":"IF(ISBLANK(E376),\"hie eu nix drischribu\",VLOOKUP(E376,'2026'!$A$16:$G$161,3,FALSE))","v":"Bregy Uli, Lisi & Pascal"}]
["2026-06-20",{"$f":"IF(ISBLANK(D377),\"Alain, nix drischribu\",VLOOKUP(D377,'2026'!$A$16:$G$161,3,FALSE))","v":"Zumofen / Gattlen"},{"$f":"VLOOKUP(D377,'2026'!$A$16:$B$161,2,FALSE)","v":"Valdeeze"},88,13,{"$f":"VLOOKUP(E377,'2026'!$A$16:$G$161,2,FALSE)","v":"Cora"},{"$f":"IF(ISBLANK(E377),\"hie eu nix drischribu\",VLOOKUP(E377,'2026'!$A$16:$G$161,3,FALSE))","v":"Bregy Uli, Lisi & Pascal"}]
["2026-06-20",{"$f":"IF(ISBLANK(D378),\"Alain, nix drischribu\",VLOOKUP(D378,'2026'!$A$16:$G$161,3,FALSE))","v":"Zumofen / Gattlen"},{"$f":"VLOOKUP(D378,'2026'!$A$16:$B$161,2,FALSE)","v":"Verygood"},89,23,{"$f":"VLOOKUP(E378,'2026'!$A$16:$G$161,2,FALSE)","v":"Soraya"},{"$f":"IF(ISBLANK(E378),\"hie eu nix drischribu\",VLOOKUP(E378,'2026'!$A$16:$G$161,3,FALSE))","v":"Gebrüder Jäger"}]
["2026-06-20",{"$f":"IF(ISBLANK(D379),\"Alain, nix drischribu\",VLOOKUP(D379,'2026'!$A$16:$G$161,3,FALSE))","v":"Hutter Richard"},{"$f":"VLOOKUP(D379,'2026'!$A$16:$B$161,2,FALSE)","v":"Fiona"},71,88,{"$f":"VLOOKUP(E379,'2026'!$A$16:$G$161,2,FALSE)","v":"Valdeeze"},{"$f":"IF(ISBLANK(E379),\"hie eu nix drischribu\",VLOOKUP(E379,'2026'!$A$16:$G$161,3,FALSE))","v":"Zumofen / Gattlen"}]
["2026-06-20",{"$f":"IF(ISBLANK(D380),\"Alain, nix drischribu\",VLOOKUP(D380,'2026'!$A$16:$G$161,3,FALSE))","v":"Stallung Jäger & Tscherrig"},{"$f":"VLOOKUP(D380,'2026'!$A$16:$B$161,2,FALSE)","v":"Pixel"},58,16,{"$f":"VLOOKUP(E380,'2026'!$A$16:$G$161,2,FALSE)","v":"Belle"},{"$f":"IF(ISBLANK(E380),\"hie eu nix drischribu\",VLOOKUP(E380,'2026'!$A$16:$G$161,3,FALSE))","v":"Bregy Uli, Lisi & Pascal"}]
["2026-06-20",{"$f":"IF(ISBLANK(D381),\"Alain, nix drischribu\",VLOOKUP(D381,'2026'!$A$16:$G$161,3,FALSE))","v":"Zumofen / Gattlen"},{"$f":"VLOOKUP(D381,'2026'!$A$16:$B$161,2,FALSE)","v":"Valdeeze"},88,7,{"$f":"VLOOKUP(E381,'2026'!$A$16:$G$161,2,FALSE)","v":"Bilbao"},{"$f":"IF(ISBLANK(E381),\"hie eu nix drischribu\",VLOOKUP(E381,'2026'!$A$16:$G$161,3,FALSE))","v":"Bregy Alain"}]
["2026-06-20",{"$f":"IF(ISBLANK(D382),\"Alain, nix drischribu\",VLOOKUP(D382,'2026'!$A$16:$G$161,3,FALSE))","v":"Bayard Medard & Gustav"},{"$f":"VLOOKUP(D382,'2026'!$A$16:$B$161,2,FALSE)","v":"Vampir"},4,31,{"$f":"VLOOKUP(E382,'2026'!$A$16:$G$161,2,FALSE)","v":"Santana"},{"$f":"IF(ISBLANK(E382),\"hie eu nix drischribu\",VLOOKUP(E382,'2026'!$A$16:$G$161,3,FALSE))","v":"Gebrüder Jäger"}]
["2026-06-20",{"$f":"IF(ISBLANK(D383),\"Alain, nix drischribu\",VLOOKUP(D383,'2026'!$A$16:$G$161,3,FALSE))","v":"Stallung Passeraub"},{"$f":"VLOOKUP(D383,'2026'!$A$16:$B$161,2,FALSE)","v":"Belana"},65,87,{"$f":"VLOOKUP(E383,'2026'!$A$16:$G$161,2,FALSE)","v":"Fame"},{"$f":"IF(ISBLANK(E383),\"hie eu nix drischribu\",VLOOKUP(E383,'2026'!$A$16:$G$161,3,FALSE))","v":"Zumofen / Gattlen"}]
["2026-06-20",{"$f":"IF(ISBLANK(D384),\"Alain, nix drischribu\",VLOOKUP(D384,'2026'!$A$16:$G$161,3,FALSE))","v":"Bregy Uli, Lisi & Pascal"},{"$f":"VLOOKUP(D384,'2026'!$A$16:$B$161,2,FALSE)","v":"Belle"},16,72,{"$f":"VLOOKUP(E384,'2026'!$A$16:$G$161,2,FALSE)","v":"Poseidon"},{"$f":"IF(ISBLANK(E384),\"hie eu nix drischribu\",VLOOKUP(E384,'2026'!$A$16:$G$161,3,FALSE))","v":"Hutter Richard"}]
["2026-06-20",{"$f":"IF(ISBLANK(D385),\"Alain, nix drischribu\",VLOOKUP(D385,'2026'!$A$16:$G$161,3,FALSE))","v":"Familie Leiggener"},{"$f":"VLOOKUP(D385,'2026'!$A$16:$B$161,2,FALSE)","v":"Royale"},21,67,{"$f":"VLOOKUP(E385,'2026'!$A$16:$G$161,2,FALSE)","v":"Boriana"},{"$f":"IF(ISBLANK(E385),\"hie eu nix drischribu\",VLOOKUP(E385,'2026'!$A$16:$G$161,3,FALSE))","v":"Stallung Passeraub"}]
["2026-06-20",{"$f":"IF(ISBLANK(D386),\"Alain, nix drischribu\",VLOOKUP(D386,'2026'!$A$16:$G$161,3,FALSE))","v":"Zumofen / Gattlen"},{"$f":"VLOOKUP(D386,'2026'!$A$16:$B$161,2,FALSE)","v":"Roseau"},92,61,{"$f":"VLOOKUP(E386,'2026'!$A$16:$G$161,2,FALSE)","v":"Puma"},{"$f":"IF(ISBLANK(E386),\"hie eu nix drischribu\",VLOOKUP(E386,'2026'!$A$16:$G$161,3,FALSE))","v":"Stallung Jäger & Tscherrig"}]
["2026-06-20",{"$f":"IF(ISBLANK(D387),\"Alain, nix drischribu\",VLOOKUP(D387,'2026'!$A$16:$G$161,3,FALSE))","v":"Williner Anton"},{"$f":"VLOOKUP(D387,'2026'!$A$16:$B$161,2,FALSE)","v":"Tirana"},77,10,{"$f":"VLOOKUP(E387,'2026'!$A$16:$G$161,2,FALSE)","v":"Perona"},{"$f":"IF(ISBLANK(E387),\"hie eu nix drischribu\",VLOOKUP(E387,'2026'!$A$16:$G$161,3,FALSE))","v":"Bregy Uli, Lisi & Pascal"}]
["2026-06-20",{"$f":"IF(ISBLANK(D388),\"Alain, nix drischribu\",VLOOKUP(D388,'2026'!$A$16:$G$161,3,FALSE))","v":"Stallung Jäger & Tscherrig"},{"$f":"VLOOKUP(D388,'2026'!$A$16:$B$161,2,FALSE)","v":"Samba"},49,22,{"$f":"VLOOKUP(E388,'2026'!$A$16:$G$161,2,FALSE)","v":"Tyson"},{"$f":"IF(ISBLANK(E388),\"hie eu nix drischribu\",VLOOKUP(E388,'2026'!$A$16:$G$161,3,FALSE))","v":"Familie Leiggener"}]
["2026-06-20",{"$f":"IF(ISBLANK(D389),\"Alain, nix drischribu\",VLOOKUP(D389,'2026'!$A$16:$G$161,3,FALSE))","v":"Gebrüder Jäger"},{"$f":"VLOOKUP(D389,'2026'!$A$16:$B$161,2,FALSE)","v":"Betty Boop"},26,29,{"$f":"VLOOKUP(E389,'2026'!$A$16:$G$161,2,FALSE)","v":"Tequila"},{"$f":"IF(ISBLANK(E389),\"hie eu nix drischribu\",VLOOKUP(E389,'2026'!$A$16:$G$161,3,FALSE))","v":"Gebrüder Jäger"}]
["2026-06-20",{"$f":"IF(ISBLANK(D390),\"Alain, nix drischribu\",VLOOKUP(D390,'2026'!$A$16:$G$161,3,FALSE))","v":"Hischier H. & Bühlmann J."},{"$f":"VLOOKUP(D390,'2026'!$A$16:$B$161,2,FALSE)","v":"Tara"},44,15,{"$f":"VLOOKUP(E390,'2026'!$A$16:$G$161,2,FALSE)","v":"Souma"},{"$f":"IF(ISBLANK(E390),\"hie eu nix drischribu\",VLOOKUP(E390,'2026'!$A$16:$G$161,3,FALSE))","v":"Bregy Uli, Lisi & Pascal"}]
["2026-06-20",{"$f":"IF(ISBLANK(D391),\"Alain, nix drischribu\",VLOOKUP(D391,'2026'!$A$16:$G$161,3,FALSE))","v":"Stallung Passeraub"},{"$f":"VLOOKUP(D391,'2026'!$A$16:$B$161,2,FALSE)","v":"Bolienne"},68,26,{"$f":"VLOOKUP(E391,'2026'!$A$16:$G$161,2,FALSE)","v":"Betty Boop"},{"$f":"IF(ISBLANK(E391),\"hie eu nix drischribu\",VLOOKUP(E391,'2026'!$A$16:$G$161,3,FALSE))","v":"Gebrüder Jäger"}]
["2026-06-20",{"$f":"IF(ISBLANK(D392),\"Alain, nix drischribu\",VLOOKUP(D392,'2026'!$A$16:$G$161,3,FALSE))","v":"Lauber Noah & Jonas"},{"$f":"VLOOKUP(D392,'2026'!$A$16:$B$161,2,FALSE)","v":"Ramona"},47,16,{"$f":"VLOOKUP(E392,'2026'!$A$16:$G$161,2,FALSE)","v":"Belle"},{"$f":"IF(ISBLANK(E392),\"hie eu nix drischribu\",VLOOKUP(E392,'2026'!$A$16:$G$161,3,FALSE))","v":"Bregy Uli, Lisi & Pascal"}]
["2026-06-20",{"$f":"IF(ISBLANK(D393),\"Alain, nix drischribu\",VLOOKUP(D393,'2026'!$A$16:$G$161,3,FALSE))","v":"Hutter Richard"},{"$f":"VLOOKUP(D393,'2026'!$A$16:$B$161,2,FALSE)","v":"Poseidon"},72,47,{"$f":"VLOOKUP(E393,'2026'!$A$16:$G$161,2,FALSE)","v":"Ramona"},{"$f":"IF(ISBLANK(E393),\"hie eu nix drischribu\",VLOOKUP(E393,'2026'!$A$16:$G$161,3,FALSE))","v":"Lauber Noah & Jonas"}]
["2026-06-20",{"$f":"IF(ISBLANK(D394),\"Alain, nix drischribu\",VLOOKUP(D394,'2026'!$A$16:$G$161,3,FALSE))","v":"Bregy Alain"},{"$f":"VLOOKUP(D394,'2026'!$A$16:$B$161,2,FALSE)","v":"Cataille"},6,46,{"$f":"VLOOKUP(E394,'2026'!$A$16:$G$161,2,FALSE)","v":"Cherico"},{"$f":"IF(ISBLANK(E394),\"hie eu nix drischribu\",VLOOKUP(E394,'2026'!$A$16:$G$161,3,FALSE))","v":"Lauber Noah & Jonas"}]
["2026-06-20",{"$f":"IF(ISBLANK(D395),\"Alain, nix drischribu\",VLOOKUP(D395,'2026'!$A$16:$G$161,3,FALSE))","v":"Bregy Uli, Lisi & Pascal"},{"$f":"VLOOKUP(D395,'2026'!$A$16:$B$161,2,FALSE)","v":"Perona"},10,61,{"$f":"VLOOKUP(E395,'2026'!$A$16:$G$161,2,FALSE)","v":"Puma"},{"$f":"IF(ISBLANK(E395),\"hie eu nix drischribu\",VLOOKUP(E395,'2026'!$A$16:$G$161,3,FALSE))","v":"Stallung Jäger & Tscherrig"}]
["2026-06-20",{"$f":"IF(ISBLANK(D396),\"Alain, nix drischribu\",VLOOKUP(D396,'2026'!$A$16:$G$161,3,FALSE))","v":"Familie Leiggener"},{"$f":"VLOOKUP(D396,'2026'!$A$16:$B$161,2,FALSE)","v":"Royale"},21,55,{"$f":"VLOOKUP(E396,'2026'!$A$16:$G$161,2,FALSE)","v":"Myla"},{"$f":"IF(ISBLANK(E396),\"hie eu nix drischribu\",VLOOKUP(E396,'2026'!$A$16:$G$161,3,FALSE))","v":"Stallung Jäger & Tscherrig"}]
["2026-06-20",{"$f":"IF(ISBLANK(D397),\"Alain, nix drischribu\",VLOOKUP(D397,'2026'!$A$16:$G$161,3,FALSE))","v":"Gebrüder Jäger"},{"$f":"VLOOKUP(D397,'2026'!$A$16:$B$161,2,FALSE)","v":"Betty Boop"},26,30,{"$f":"VLOOKUP(E397,'2026'!$A$16:$G$161,2,FALSE)","v":"Tamango"},{"$f":"IF(ISBLANK(E397),\"hie eu nix drischribu\",VLOOKUP(E397,'2026'!$A$16:$G$161,3,FALSE))","v":"Gebrüder Jäger"}]
["2026-06-20",{"$f":"IF(ISBLANK(D398),\"Alain, nix drischribu\",VLOOKUP(D398,'2026'!$A$16:$G$161,3,FALSE))","v":"Hutter Richard"},{"$f":"VLOOKUP(D398,'2026'!$A$16:$B$161,2,FALSE)","v":"Fiona"},71,33,{"$f":"VLOOKUP(E398,'2026'!$A$16:$G$161,2,FALSE)","v":"Pouki"},{"$f":"IF(ISBLANK(E398),\"hie eu nix drischribu\",VLOOKUP(E398,'2026'!$A$16:$G$161,3,FALSE))","v":"Lötscher Sandrine & Cédric"}]
["2026-06-19",{"$f":"IF(ISBLANK(D399),\"Alain, nix drischribu\",VLOOKUP(D399,'2026'!$A$16:$G$161,3,FALSE))","v":"Bayard Medard & Gustav"},{"$f":"VLOOKUP(D399,'2026'!$A$16:$B$161,2,FALSE)","v":"Vampir"},4,23,{"$f":"VLOOKUP(E399,'2026'!$A$16:$G$161,2,FALSE)","v":"Soraya"},{"$f":"IF(ISBLANK(E399),\"hie eu nix drischribu\",VLOOKUP(E399,'2026'!$A$16:$G$161,3,FALSE))","v":"Gebrüder Jäger"}]
["2026-06-19",{"$f":"IF(ISBLANK(D400),\"Alain, nix drischribu\",VLOOKUP(D400,'2026'!$A$16:$G$161,3,FALSE))","v":"Zumofen / Gattlen"},{"$f":"VLOOKUP(D400,'2026'!$A$16:$B$161,2,FALSE)","v":"Roquette"},86,52,{"$f":"VLOOKUP(E400,'2026'!$A$16:$G$161,2,FALSE)","v":"Santana"},{"$f":"IF(ISBLANK(E400),\"hie eu nix drischribu\",VLOOKUP(E400,'2026'!$A$16:$G$161,3,FALSE))","v":"Stallung Jäger & Tscherrig"}]
["2026-06-19",{"$f":"IF(ISBLANK(D401),\"Alain, nix drischribu\",VLOOKUP(D401,'2026'!$A$16:$G$161,3,FALSE))","v":"Bregy Uli, Lisi & Pascal"},{"$f":"VLOOKUP(D401,'2026'!$A$16:$B$161,2,FALSE)","v":"Belle"},16,24,{"$f":"VLOOKUP(E401,'2026'!$A$16:$G$161,2,FALSE)","v":"Tamara"},{"$f":"IF(ISBLANK(E401),\"hie eu nix drischribu\",VLOOKUP(E401,'2026'!$A$16:$G$161,3,FALSE))","v":"Gebrüder Jäger"}]
["2026-06-19",{"$f":"IF(ISBLANK(D402),\"Alain, nix drischribu\",VLOOKUP(D402,'2026'!$A$16:$G$161,3,FALSE))","v":"Stallung Passeraub"},{"$f":"VLOOKUP(D402,'2026'!$A$16:$B$161,2,FALSE)","v":"Belana"},65,26,{"$f":"VLOOKUP(E402,'2026'!$A$16:$G$161,2,FALSE)","v":"Betty Boop"},{"$f":"IF(ISBLANK(E402),\"hie eu nix drischribu\",VLOOKUP(E402,'2026'!$A$16:$G$161,3,FALSE))","v":"Gebrüder Jäger"}]
["2026-06-19",{"$f":"IF(ISBLANK(D403),\"Alain, nix drischribu\",VLOOKUP(D403,'2026'!$A$16:$G$161,3,FALSE))","v":"Stallung Jäger & Tscherrig"},{"$f":"VLOOKUP(D403,'2026'!$A$16:$B$161,2,FALSE)","v":"Metis"},48,66,{"$f":"VLOOKUP(E403,'2026'!$A$16:$G$161,2,FALSE)","v":"Beluga"},{"$f":"IF(ISBLANK(E403),\"hie eu nix drischribu\",VLOOKUP(E403,'2026'!$A$16:$G$161,3,FALSE))","v":"Stallung Passeraub"}]
["2026-06-19",{"$f":"IF(ISBLANK(D404),\"Alain, nix drischribu\",VLOOKUP(D404,'2026'!$A$16:$G$161,3,FALSE))","v":"Stallung Passeraub"},{"$f":"VLOOKUP(D404,'2026'!$A$16:$B$161,2,FALSE)","v":"Bandera"},69,61,{"$f":"VLOOKUP(E404,'2026'!$A$16:$G$161,2,FALSE)","v":"Puma"},{"$f":"IF(ISBLANK(E404),\"hie eu nix drischribu\",VLOOKUP(E404,'2026'!$A$16:$G$161,3,FALSE))","v":"Stallung Jäger & Tscherrig"}]
["2026-06-19",{"$f":"IF(ISBLANK(D405),\"Alain, nix drischribu\",VLOOKUP(D405,'2026'!$A$16:$G$161,3,FALSE))","v":"Stallung Jäger & Tscherrig"},{"$f":"VLOOKUP(D405,'2026'!$A$16:$B$161,2,FALSE)","v":"Sina"},53,73,{"$f":"VLOOKUP(E405,'2026'!$A$16:$G$161,2,FALSE)","v":"Malice"},{"$f":"IF(ISBLANK(E405),\"hie eu nix drischribu\",VLOOKUP(E405,'2026'!$A$16:$G$161,3,FALSE))","v":"Stallung Passeraub"}]
["2026-06-19",{"$f":"IF(ISBLANK(D406),\"Alain, nix drischribu\",VLOOKUP(D406,'2026'!$A$16:$G$161,3,FALSE))","v":"Familie Leiggener"},{"$f":"VLOOKUP(D406,'2026'!$A$16:$B$161,2,FALSE)","v":"Tyson"},22,9,{"$f":"VLOOKUP(E406,'2026'!$A$16:$G$161,2,FALSE)","v":"Banja"},{"$f":"IF(ISBLANK(E406),\"hie eu nix drischribu\",VLOOKUP(E406,'2026'!$A$16:$G$161,3,FALSE))","v":"Bregy Alain"}]
["2026-06-19",{"$f":"IF(ISBLANK(D407),\"Alain, nix drischribu\",VLOOKUP(D407,'2026'!$A$16:$G$161,3,FALSE))","v":"Zumofen / Gattlen"},{"$f":"VLOOKUP(D407,'2026'!$A$16:$B$161,2,FALSE)","v":"Rigolo"},83,48,{"$f":"VLOOKUP(E407,'2026'!$A$16:$G$161,2,FALSE)","v":"Metis"},{"$f":"IF(ISBLANK(E407),\"hie eu nix drischribu\",VLOOKUP(E407,'2026'!$A$16:$G$161,3,FALSE))","v":"Stallung Jäger & Tscherrig"}]
["2026-06-19",{"$f":"IF(ISBLANK(D408),\"Alain, nix drischribu\",VLOOKUP(D408,'2026'!$A$16:$G$161,3,FALSE))","v":"Stallung Jäger & Tscherrig"},{"$f":"VLOOKUP(D408,'2026'!$A$16:$B$161,2,FALSE)","v":"Fanny"},56,20,{"$f":"VLOOKUP(E408,'2026'!$A$16:$G$161,2,FALSE)","v":"Tirana"},{"$f":"IF(ISBLANK(E408),\"hie eu nix drischribu\",VLOOKUP(E408,'2026'!$A$16:$G$161,3,FALSE))","v":"Familie Leiggener"}]
["2026-06-19",{"$f":"IF(ISBLANK(D409),\"Alain, nix drischribu\",VLOOKUP(D409,'2026'!$A$16:$G$161,3,FALSE))","v":"Stallung Jäger & Tscherrig"},{"$f":"VLOOKUP(D409,'2026'!$A$16:$B$161,2,FALSE)","v":"Santana"},52,93,{"$f":"VLOOKUP(E409,'2026'!$A$16:$G$161,2,FALSE)","v":"Farinelle"},{"$f":"IF(ISBLANK(E409),\"hie eu nix drischribu\",VLOOKUP(E409,'2026'!$A$16:$G$161,3,FALSE))","v":"Zumofen / Gattlen"}]
["2026-06-19",{"$f":"IF(ISBLANK(D410),\"Alain, nix drischribu\",VLOOKUP(D410,'2026'!$A$16:$G$161,3,FALSE))","v":"Gebrüder Jäger"},{"$f":"VLOOKUP(D410,'2026'!$A$16:$B$161,2,FALSE)","v":"Luna"},28,31,{"$f":"VLOOKUP(E410,'2026'!$A$16:$G$161,2,FALSE)","v":"Santana"},{"$f":"IF(ISBLANK(E410),\"hie eu nix drischribu\",VLOOKUP(E410,'2026'!$A$16:$G$161,3,FALSE))","v":"Gebrüder Jäger"}]
["2026-06-19",{"$f":"IF(ISBLANK(D411),\"Alain, nix drischribu\",VLOOKUP(D411,'2026'!$A$16:$G$161,3,FALSE))","v":"Gebrüder Jäger"},{"$f":"VLOOKUP(D411,'2026'!$A$16:$B$161,2,FALSE)","v":"Betty Boop"},26,5,{"$f":"VLOOKUP(E411,'2026'!$A$16:$G$161,2,FALSE)","v":"Valerie"},{"$f":"IF(ISBLANK(E411),\"hie eu nix drischribu\",VLOOKUP(E411,'2026'!$A$16:$G$161,3,FALSE))","v":"Bayard Medard & Gustav"}]
["2026-06-19",{"$f":"IF(ISBLANK(D412),\"Alain, nix drischribu\",VLOOKUP(D412,'2026'!$A$16:$G$161,3,FALSE))","v":"Stallung Jäger & Tscherrig"},{"$f":"VLOOKUP(D412,'2026'!$A$16:$B$161,2,FALSE)","v":"Santana"},52,10,{"$f":"VLOOKUP(E412,'2026'!$A$16:$G$161,2,FALSE)","v":"Perona"},{"$f":"IF(ISBLANK(E412),\"hie eu nix drischribu\",VLOOKUP(E412,'2026'!$A$16:$G$161,3,FALSE))","v":"Bregy Uli, Lisi & Pascal"}]
["2026-06-19",{"$f":"IF(ISBLANK(D413),\"Alain, nix drischribu\",VLOOKUP(D413,'2026'!$A$16:$G$161,3,FALSE))","v":"Stallung Passeraub"},{"$f":"VLOOKUP(D413,'2026'!$A$16:$B$161,2,FALSE)","v":"Beluga"},66,85,{"$f":"VLOOKUP(E413,'2026'!$A$16:$G$161,2,FALSE)","v":"Xea"},{"$f":"IF(ISBLANK(E413),\"hie eu nix drischribu\",VLOOKUP(E413,'2026'!$A$16:$G$161,3,FALSE))","v":"Zumofen / Gattlen"}]
["2026-06-19",{"$f":"IF(ISBLANK(D414),\"Alain, nix drischribu\",VLOOKUP(D414,'2026'!$A$16:$G$161,3,FALSE))","v":"Williner Anton"},{"$f":"VLOOKUP(D414,'2026'!$A$16:$B$161,2,FALSE)","v":"Venus"},76,13,{"$f":"VLOOKUP(E414,'2026'!$A$16:$G$161,2,FALSE)","v":"Cora"},{"$f":"IF(ISBLANK(E414),\"hie eu nix drischribu\",VLOOKUP(E414,'2026'!$A$16:$G$161,3,FALSE))","v":"Bregy Uli, Lisi & Pascal"}]
["2026-06-19",{"$f":"IF(ISBLANK(D415),\"Alain, nix drischribu\",VLOOKUP(D415,'2026'!$A$16:$G$161,3,FALSE))","v":"Zumofen / Gattlen"},{"$f":"VLOOKUP(D415,'2026'!$A$16:$B$161,2,FALSE)","v":"Roquette"},86,73,{"$f":"VLOOKUP(E415,'2026'!$A$16:$G$161,2,FALSE)","v":"Malice"},{"$f":"IF(ISBLANK(E415),\"hie eu nix drischribu\",VLOOKUP(E415,'2026'!$A$16:$G$161,3,FALSE))","v":"Stallung Passeraub"}]
["2026-06-19",{"$f":"IF(ISBLANK(D416),\"Alain, nix drischribu\",VLOOKUP(D416,'2026'!$A$16:$G$161,3,FALSE))","v":"Zumofen / Gattlen"},{"$f":"VLOOKUP(D416,'2026'!$A$16:$B$161,2,FALSE)","v":"Fame"},87,78,{"$f":"VLOOKUP(E416,'2026'!$A$16:$G$161,2,FALSE)","v":"Timba"},{"$f":"IF(ISBLANK(E416),\"hie eu nix drischribu\",VLOOKUP(E416,'2026'!$A$16:$G$161,3,FALSE))","v":"Williner Anton"}]
["2026-06-19",{"$f":"IF(ISBLANK(D417),\"Alain, nix drischribu\",VLOOKUP(D417,'2026'!$A$16:$G$161,3,FALSE))","v":"Bayard Medard & Gustav"},{"$f":"VLOOKUP(D417,'2026'!$A$16:$B$161,2,FALSE)","v":"Vampir"},4,56,{"$f":"VLOOKUP(E417,'2026'!$A$16:$G$161,2,FALSE)","v":"Fanny"},{"$f":"IF(ISBLANK(E417),\"hie eu nix drischribu\",VLOOKUP(E417,'2026'!$A$16:$G$161,3,FALSE))","v":"Stallung Jäger & Tscherrig"}]
["2026-06-18",{"$f":"IF(ISBLANK(D418),\"Alain, nix drischribu\",VLOOKUP(D418,'2026'!$A$16:$G$161,3,FALSE))","v":"Zumofen / Gattlen"},{"$f":"VLOOKUP(D418,'2026'!$A$16:$B$161,2,FALSE)","v":"Farinelle"},93,36,{"$f":"VLOOKUP(E418,'2026'!$A$16:$G$161,2,FALSE)","v":"Perle"},{"$f":"IF(ISBLANK(E418),\"hie eu nix drischribu\",VLOOKUP(E418,'2026'!$A$16:$G$161,3,FALSE))","v":"Lötscher Sandrine & Cédric"}]
["2026-06-18",{"$f":"IF(ISBLANK(D419),\"Alain, nix drischribu\",VLOOKUP(D419,'2026'!$A$16:$G$161,3,FALSE))","v":"Bregy Uli, Lisi & Pascal"},{"$f":"VLOOKUP(D419,'2026'!$A$16:$B$161,2,FALSE)","v":"Cara"},12,1,{"$f":"VLOOKUP(E419,'2026'!$A$16:$G$161,2,FALSE)","v":"Vaya"},{"$f":"IF(ISBLANK(E419),\"hie eu nix drischribu\",VLOOKUP(E419,'2026'!$A$16:$G$161,3,FALSE))","v":"Bayard Jan"}]
["2026-06-18",{"$f":"IF(ISBLANK(D420),\"Alain, nix drischribu\",VLOOKUP(D420,'2026'!$A$16:$G$161,3,FALSE))","v":"Stallung Passeraub"},{"$f":"VLOOKUP(D420,'2026'!$A$16:$B$161,2,FALSE)","v":"Malice"},73,9,{"$f":"VLOOKUP(E420,'2026'!$A$16:$G$161,2,FALSE)","v":"Banja"},{"$f":"IF(ISBLANK(E420),\"hie eu nix drischribu\",VLOOKUP(E420,'2026'!$A$16:$G$161,3,FALSE))","v":"Bregy Alain"}]
["2026-06-18",{"$f":"IF(ISBLANK(D421),\"Alain, nix drischribu\",VLOOKUP(D421,'2026'!$A$16:$G$161,3,FALSE))","v":"Bregy Uli, Lisi & Pascal"},{"$f":"VLOOKUP(D421,'2026'!$A$16:$B$161,2,FALSE)","v":"Calina"},18,34,{"$f":"VLOOKUP(E421,'2026'!$A$16:$G$161,2,FALSE)","v":"Mesquine"},{"$f":"IF(ISBLANK(E421),\"hie eu nix drischribu\",VLOOKUP(E421,'2026'!$A$16:$G$161,3,FALSE))","v":"Lötscher Sandrine & Cédric"}]
["2026-06-18",{"$f":"IF(ISBLANK(D422),\"Alain, nix drischribu\",VLOOKUP(D422,'2026'!$A$16:$G$161,3,FALSE))","v":"Gebrüder Jäger"},{"$f":"VLOOKUP(D422,'2026'!$A$16:$B$161,2,FALSE)","v":"Soraya"},23,68,{"$f":"VLOOKUP(E422,'2026'!$A$16:$G$161,2,FALSE)","v":"Bolienne"},{"$f":"IF(ISBLANK(E422),\"hie eu nix drischribu\",VLOOKUP(E422,'2026'!$A$16:$G$161,3,FALSE))","v":"Stallung Passeraub"}]
["2026-06-18",{"$f":"IF(ISBLANK(D423),\"Alain, nix drischribu\",VLOOKUP(D423,'2026'!$A$16:$G$161,3,FALSE))","v":"Familie Leiggener"},{"$f":"VLOOKUP(D423,'2026'!$A$16:$B$161,2,FALSE)","v":"Tyson"},22,1,{"$f":"VLOOKUP(E423,'2026'!$A$16:$G$161,2,FALSE)","v":"Vaya"},{"$f":"IF(ISBLANK(E423),\"hie eu nix drischribu\",VLOOKUP(E423,'2026'!$A$16:$G$161,3,FALSE))","v":"Bayard Jan"}]
["2026-06-18",{"$f":"IF(ISBLANK(D424),\"Alain, nix drischribu\",VLOOKUP(D424,'2026'!$A$16:$G$161,3,FALSE))","v":"Bregy Alain"},{"$f":"VLOOKUP(D424,'2026'!$A$16:$B$161,2,FALSE)","v":"Valesia"},8,17,{"$f":"VLOOKUP(E424,'2026'!$A$16:$G$161,2,FALSE)","v":"Panja"},{"$f":"IF(ISBLANK(E424),\"hie eu nix drischribu\",VLOOKUP(E424,'2026'!$A$16:$G$161,3,FALSE))","v":"Bregy Uli, Lisi & Pascal"}]
["2026-06-18",{"$f":"IF(ISBLANK(D425),\"Alain, nix drischribu\",VLOOKUP(D425,'2026'!$A$16:$G$161,3,FALSE))","v":"Bregy Uli, Lisi & Pascal"},{"$f":"VLOOKUP(D425,'2026'!$A$16:$B$161,2,FALSE)","v":"Belle"},16,42,{"$f":"VLOOKUP(E425,'2026'!$A$16:$G$161,2,FALSE)","v":"Alena"},{"$f":"IF(ISBLANK(E425),\"hie eu nix drischribu\",VLOOKUP(E425,'2026'!$A$16:$G$161,3,FALSE))","v":"Hischier H. & Bühlmann J."}]
["2026-06-18",{"$f":"IF(ISBLANK(D426),\"Alain, nix drischribu\",VLOOKUP(D426,'2026'!$A$16:$G$161,3,FALSE))","v":"Gebrüder Jäger"},{"$f":"VLOOKUP(D426,'2026'!$A$16:$B$161,2,FALSE)","v":"Tirana"},25,42,{"$f":"VLOOKUP(E426,'2026'!$A$16:$G$161,2,FALSE)","v":"Alena"},{"$f":"IF(ISBLANK(E426),\"hie eu nix drischribu\",VLOOKUP(E426,'2026'!$A$16:$G$161,3,FALSE))","v":"Hischier H. & Bühlmann J."}]
["2026-06-18",{"$f":"IF(ISBLANK(D427),\"Alain, nix drischribu\",VLOOKUP(D427,'2026'!$A$16:$G$161,3,FALSE))","v":"Stallung Passeraub"},{"$f":"VLOOKUP(D427,'2026'!$A$16:$B$161,2,FALSE)","v":"Belana"},65,21,{"$f":"VLOOKUP(E427,'2026'!$A$16:$G$161,2,FALSE)","v":"Royale"},{"$f":"IF(ISBLANK(E427),\"hie eu nix drischribu\",VLOOKUP(E427,'2026'!$A$16:$G$161,3,FALSE))","v":"Familie Leiggener"}]
["2026-06-18",{"$f":"IF(ISBLANK(D428),\"Alain, nix drischribu\",VLOOKUP(D428,'2026'!$A$16:$G$161,3,FALSE))","v":"Stallung Jäger & Tscherrig"},{"$f":"VLOOKUP(D428,'2026'!$A$16:$B$161,2,FALSE)","v":"Sina"},53,26,{"$f":"VLOOKUP(E428,'2026'!$A$16:$G$161,2,FALSE)","v":"Betty Boop"},{"$f":"IF(ISBLANK(E428),\"hie eu nix drischribu\",VLOOKUP(E428,'2026'!$A$16:$G$161,3,FALSE))","v":"Gebrüder Jäger"}]
["2026-06-18",{"$f":"IF(ISBLANK(D429),\"Alain, nix drischribu\",VLOOKUP(D429,'2026'!$A$16:$G$161,3,FALSE))","v":"Stallung Jäger & Tscherrig"},{"$f":"VLOOKUP(D429,'2026'!$A$16:$B$161,2,FALSE)","v":"Santana"},52,91,{"$f":"VLOOKUP(E429,'2026'!$A$16:$G$161,2,FALSE)","v":"Vergara"},{"$f":"IF(ISBLANK(E429),\"hie eu nix drischribu\",VLOOKUP(E429,'2026'!$A$16:$G$161,3,FALSE))","v":"Zumofen / Gattlen"}]
["2026-06-18",{"$f":"IF(ISBLANK(D430),\"Alain, nix drischribu\",VLOOKUP(D430,'2026'!$A$16:$G$161,3,FALSE))","v":"Williner Anton"},{"$f":"VLOOKUP(D430,'2026'!$A$16:$B$161,2,FALSE)","v":"Timba"},78,91,{"$f":"VLOOKUP(E430,'2026'!$A$16:$G$161,2,FALSE)","v":"Vergara"},{"$f":"IF(ISBLANK(E430),\"hie eu nix drischribu\",VLOOKUP(E430,'2026'!$A$16:$G$161,3,FALSE))","v":"Zumofen / Gattlen"}]
["2026-06-18",{"$f":"IF(ISBLANK(D431),\"Alain, nix drischribu\",VLOOKUP(D431,'2026'!$A$16:$G$161,3,FALSE))","v":"Zumofen / Gattlen"},{"$f":"VLOOKUP(D431,'2026'!$A$16:$B$161,2,FALSE)","v":"Farinelle"},93,18,{"$f":"VLOOKUP(E431,'2026'!$A$16:$G$161,2,FALSE)","v":"Calina"},{"$f":"IF(ISBLANK(E431),\"hie eu nix drischribu\",VLOOKUP(E431,'2026'!$A$16:$G$161,3,FALSE))","v":"Bregy Uli, Lisi & Pascal"}]
["2026-06-18",{"$f":"IF(ISBLANK(D432),\"Alain, nix drischribu\",VLOOKUP(D432,'2026'!$A$16:$G$161,3,FALSE))","v":"Bayard Medard & Gustav"},{"$f":"VLOOKUP(D432,'2026'!$A$16:$B$161,2,FALSE)","v":"Vampir"},4,68,{"$f":"VLOOKUP(E432,'2026'!$A$16:$G$161,2,FALSE)","v":"Bolienne"},{"$f":"IF(ISBLANK(E432),\"hie eu nix drischribu\",VLOOKUP(E432,'2026'!$A$16:$G$161,3,FALSE))","v":"Stallung Passeraub"}]
["2026-06-17",{"$f":"IF(ISBLANK(D433),\"Alain, nix drischribu\",VLOOKUP(D433,'2026'!$A$16:$G$161,3,FALSE))","v":"Zumofen / Gattlen"},{"$f":"VLOOKUP(D433,'2026'!$A$16:$B$161,2,FALSE)","v":"Roquette"},86,88,{"$f":"VLOOKUP(E433,'2026'!$A$16:$G$161,2,FALSE)","v":"Valdeeze"},{"$f":"IF(ISBLANK(E433),\"hie eu nix drischribu\",VLOOKUP(E433,'2026'!$A$16:$G$161,3,FALSE))","v":"Zumofen / Gattlen"}]
["2026-06-17",{"$f":"IF(ISBLANK(D434),\"Alain, nix drischribu\",VLOOKUP(D434,'2026'!$A$16:$G$161,3,FALSE))","v":"Stallung Jäger & Tscherrig"},{"$f":"VLOOKUP(D434,'2026'!$A$16:$B$161,2,FALSE)","v":"Fanny"},56,35,{"$f":"VLOOKUP(E434,'2026'!$A$16:$G$161,2,FALSE)","v":"Cartouche"},{"$f":"IF(ISBLANK(E434),\"hie eu nix drischribu\",VLOOKUP(E434,'2026'!$A$16:$G$161,3,FALSE))","v":"Geschwister Lötscher"}]
["2026-06-17",{"$f":"IF(ISBLANK(D435),\"Alain, nix drischribu\",VLOOKUP(D435,'2026'!$A$16:$G$161,3,FALSE))","v":"Zumofen / Gattlen"},{"$f":"VLOOKUP(D435,'2026'!$A$16:$B$161,2,FALSE)","v":"Rigolo"},83,48,{"$f":"VLOOKUP(E435,'2026'!$A$16:$G$161,2,FALSE)","v":"Metis"},{"$f":"IF(ISBLANK(E435),\"hie eu nix drischribu\",VLOOKUP(E435,'2026'!$A$16:$G$161,3,FALSE))","v":"Stallung Jäger & Tscherrig"}]
["2026-06-17",{"$f":"IF(ISBLANK(D436),\"Alain, nix drischribu\",VLOOKUP(D436,'2026'!$A$16:$G$161,3,FALSE))","v":"Hischier H. & Bühlmann J."},{"$f":"VLOOKUP(D436,'2026'!$A$16:$B$161,2,FALSE)","v":"Baghira"},43,12,{"$f":"VLOOKUP(E436,'2026'!$A$16:$G$161,2,FALSE)","v":"Cara"},{"$f":"IF(ISBLANK(E436),\"hie eu nix drischribu\",VLOOKUP(E436,'2026'!$A$16:$G$161,3,FALSE))","v":"Bregy Uli, Lisi & Pascal"}]
["2026-06-17",{"$f":"IF(ISBLANK(D437),\"Alain, nix drischribu\",VLOOKUP(D437,'2026'!$A$16:$G$161,3,FALSE))","v":"Bregy Uli, Lisi & Pascal"},{"$f":"VLOOKUP(D437,'2026'!$A$16:$B$161,2,FALSE)","v":"Panja"},17,27,{"$f":"VLOOKUP(E437,'2026'!$A$16:$G$161,2,FALSE)","v":"Silene"},{"$f":"IF(ISBLANK(E437),\"hie eu nix drischribu\",VLOOKUP(E437,'2026'!$A$16:$G$161,3,FALSE))","v":"Gebrüder Jäger"}]
["2026-06-17",{"$f":"IF(ISBLANK(D438),\"Alain, nix drischribu\",VLOOKUP(D438,'2026'!$A$16:$G$161,3,FALSE))","v":"Bayard Medard & Gustav"},{"$f":"VLOOKUP(D438,'2026'!$A$16:$B$161,2,FALSE)","v":"Vampir"},4,67,{"$f":"VLOOKUP(E438,'2026'!$A$16:$G$161,2,FALSE)","v":"Boriana"},{"$f":"IF(ISBLANK(E438),\"hie eu nix drischribu\",VLOOKUP(E438,'2026'!$A$16:$G$161,3,FALSE))","v":"Stallung Passeraub"}]
["2026-06-17",{"$f":"IF(ISBLANK(D439),\"Alain, nix drischribu\",VLOOKUP(D439,'2026'!$A$16:$G$161,3,FALSE))","v":"Bregy Uli, Lisi & Pascal"},{"$f":"VLOOKUP(D439,'2026'!$A$16:$B$161,2,FALSE)","v":"Souma"},15,37,{"$f":"VLOOKUP(E439,'2026'!$A$16:$G$161,2,FALSE)","v":"Cobra"},{"$f":"IF(ISBLANK(E439),\"hie eu nix drischribu\",VLOOKUP(E439,'2026'!$A$16:$G$161,3,FALSE))","v":"Geschwister Lötscher"}]
["2026-06-17",{"$f":"IF(ISBLANK(D440),\"Alain, nix drischribu\",VLOOKUP(D440,'2026'!$A$16:$G$161,3,FALSE))","v":"Gebrüder Jäger"},{"$f":"VLOOKUP(D440,'2026'!$A$16:$B$161,2,FALSE)","v":"Silene"},27,26,{"$f":"VLOOKUP(E440,'2026'!$A$16:$G$161,2,FALSE)","v":"Betty Boop"},{"$f":"IF(ISBLANK(E440),\"hie eu nix drischribu\",VLOOKUP(E440,'2026'!$A$16:$G$161,3,FALSE))","v":"Gebrüder Jäger"}]
["2026-06-17",{"$f":"IF(ISBLANK(D441),\"Alain, nix drischribu\",VLOOKUP(D441,'2026'!$A$16:$G$161,3,FALSE))","v":"Familie Leiggener"},{"$f":"VLOOKUP(D441,'2026'!$A$16:$B$161,2,FALSE)","v":"Tyson"},22,60,{"$f":"VLOOKUP(E441,'2026'!$A$16:$G$161,2,FALSE)","v":"Samoa"},{"$f":"IF(ISBLANK(E441),\"hie eu nix drischribu\",VLOOKUP(E441,'2026'!$A$16:$G$161,3,FALSE))","v":"Stallung Jäger & Tscherrig"}]
["2026-06-17",{"$f":"IF(ISBLANK(D442),\"Alain, nix drischribu\",VLOOKUP(D442,'2026'!$A$16:$G$161,3,FALSE))","v":"Familie Leiggener"},{"$f":"VLOOKUP(D442,'2026'!$A$16:$B$161,2,FALSE)","v":"Tyson"},22,27,{"$f":"VLOOKUP(E442,'2026'!$A$16:$G$161,2,FALSE)","v":"Silene"},{"$f":"IF(ISBLANK(E442),\"hie eu nix drischribu\",VLOOKUP(E442,'2026'!$A$16:$G$161,3,FALSE))","v":"Gebrüder Jäger"}]
["2026-06-17",{"$f":"IF(ISBLANK(D443),\"Alain, nix drischribu\",VLOOKUP(D443,'2026'!$A$16:$G$161,3,FALSE))","v":"Stallung Jäger & Tscherrig"},{"$f":"VLOOKUP(D443,'2026'!$A$16:$B$161,2,FALSE)","v":"Puma"},61,74,{"$f":"VLOOKUP(E443,'2026'!$A$16:$G$161,2,FALSE)","v":"Brunette"},{"$f":"IF(ISBLANK(E443),\"hie eu nix drischribu\",VLOOKUP(E443,'2026'!$A$16:$G$161,3,FALSE))","v":"Stallung Passeraub"}]
["2026-06-17",{"$f":"IF(ISBLANK(D444),\"Alain, nix drischribu\",VLOOKUP(D444,'2026'!$A$16:$G$161,3,FALSE))","v":"Stallung Jäger & Tscherrig"},{"$f":"VLOOKUP(D444,'2026'!$A$16:$B$161,2,FALSE)","v":"Pinga"},54,10,{"$f":"VLOOKUP(E444,'2026'!$A$16:$G$161,2,FALSE)","v":"Perona"},{"$f":"IF(ISBLANK(E444),\"hie eu nix drischribu\",VLOOKUP(E444,'2026'!$A$16:$G$161,3,FALSE))","v":"Bregy Uli, Lisi & Pascal"}]
["2026-06-17",{"$f":"IF(ISBLANK(D445),\"Alain, nix drischribu\",VLOOKUP(D445,'2026'!$A$16:$G$161,3,FALSE))","v":"Zumofen / Gattlen"},{"$f":"VLOOKUP(D445,'2026'!$A$16:$B$161,2,FALSE)","v":"Souris"},81,21,{"$f":"VLOOKUP(E445,'2026'!$A$16:$G$161,2,FALSE)","v":"Royale"},{"$f":"IF(ISBLANK(E445),\"hie eu nix drischribu\",VLOOKUP(E445,'2026'!$A$16:$G$161,3,FALSE))","v":"Familie Leiggener"}]
["2026-06-17",{"$f":"IF(ISBLANK(D446),\"Alain, nix drischribu\",VLOOKUP(D446,'2026'!$A$16:$G$161,3,FALSE))","v":"Stallung Jäger & Tscherrig"},{"$f":"VLOOKUP(D446,'2026'!$A$16:$B$161,2,FALSE)","v":"Samba"},49,81,{"$f":"VLOOKUP(E446,'2026'!$A$16:$G$161,2,FALSE)","v":"Souris"},{"$f":"IF(ISBLANK(E446),\"hie eu nix drischribu\",VLOOKUP(E446,'2026'!$A$16:$G$161,3,FALSE))","v":"Zumofen / Gattlen"}]
["2026-06-17",{"$f":"IF(ISBLANK(D447),\"Alain, nix drischribu\",VLOOKUP(D447,'2026'!$A$16:$G$161,3,FALSE))","v":"Bayard Jan"},{"$f":"VLOOKUP(D447,'2026'!$A$16:$B$161,2,FALSE)","v":"Vaya"},1,21,{"$f":"VLOOKUP(E447,'2026'!$A$16:$G$161,2,FALSE)","v":"Royale"},{"$f":"IF(ISBLANK(E447),\"hie eu nix drischribu\",VLOOKUP(E447,'2026'!$A$16:$G$161,3,FALSE))","v":"Familie Leiggener"}]
["2026-06-17",{"$f":"IF(ISBLANK(D448),\"Alain, nix drischribu\",VLOOKUP(D448,'2026'!$A$16:$G$161,3,FALSE))","v":"Stallung Jäger & Tscherrig"},{"$f":"VLOOKUP(D448,'2026'!$A$16:$B$161,2,FALSE)","v":"Bogota"},57,20,{"$f":"VLOOKUP(E448,'2026'!$A$16:$G$161,2,FALSE)","v":"Tirana"},{"$f":"IF(ISBLANK(E448),\"hie eu nix drischribu\",VLOOKUP(E448,'2026'!$A$16:$G$161,3,FALSE))","v":"Familie Leiggener"}]
["2026-06-17",{"$f":"IF(ISBLANK(D449),\"Alain, nix drischribu\",VLOOKUP(D449,'2026'!$A$16:$G$161,3,FALSE))","v":"Geschwister Lötscher"},{"$f":"VLOOKUP(D449,'2026'!$A$16:$B$161,2,FALSE)","v":"Chips"},39,60,{"$f":"VLOOKUP(E449,'2026'!$A$16:$G$161,2,FALSE)","v":"Samoa"},{"$f":"IF(ISBLANK(E449),\"hie eu nix drischribu\",VLOOKUP(E449,'2026'!$A$16:$G$161,3,FALSE))","v":"Stallung Jäger & Tscherrig"}]
["2026-06-17",{"$f":"IF(ISBLANK(D450),\"Alain, nix drischribu\",VLOOKUP(D450,'2026'!$A$16:$G$161,3,FALSE))","v":"Williner Anton"},{"$f":"VLOOKUP(D450,'2026'!$A$16:$B$161,2,FALSE)","v":"Tirana"},77,55,{"$f":"VLOOKUP(E450,'2026'!$A$16:$G$161,2,FALSE)","v":"Myla"},{"$f":"IF(ISBLANK(E450),\"hie eu nix drischribu\",VLOOKUP(E450,'2026'!$A$16:$G$161,3,FALSE))","v":"Stallung Jäger & Tscherrig"}]
["2026-06-17",{"$f":"IF(ISBLANK(D451),\"Alain, nix drischribu\",VLOOKUP(D451,'2026'!$A$16:$G$161,3,FALSE))","v":"Williner Anton"},{"$f":"VLOOKUP(D451,'2026'!$A$16:$B$161,2,FALSE)","v":"Tirana"},77,75,{"$f":"VLOOKUP(E451,'2026'!$A$16:$G$161,2,FALSE)","v":"Baldrun"},{"$f":"IF(ISBLANK(E451),\"hie eu nix drischribu\",VLOOKUP(E451,'2026'!$A$16:$G$161,3,FALSE))","v":"Stallung Passeraub"}]
["2026-06-17",{"$f":"IF(ISBLANK(D452),\"Alain, nix drischribu\",VLOOKUP(D452,'2026'!$A$16:$G$161,3,FALSE))","v":"Stallung Jäger & Tscherrig"},{"$f":"VLOOKUP(D452,'2026'!$A$16:$B$161,2,FALSE)","v":"Metis"},48,85,{"$f":"VLOOKUP(E452,'2026'!$A$16:$G$161,2,FALSE)","v":"Xea"},{"$f":"IF(ISBLANK(E452),\"hie eu nix drischribu\",VLOOKUP(E452,'2026'!$A$16:$G$161,3,FALSE))","v":"Zumofen / Gattlen"}]
["2026-06-17",{"$f":"IF(ISBLANK(D453),\"Alain, nix drischribu\",VLOOKUP(D453,'2026'!$A$16:$G$161,3,FALSE))","v":"Lötscher Sandrine & Cédric"},{"$f":"VLOOKUP(D453,'2026'!$A$16:$B$161,2,FALSE)","v":"Pandora"},40,61,{"$f":"VLOOKUP(E453,'2026'!$A$16:$G$161,2,FALSE)","v":"Puma"},{"$f":"IF(ISBLANK(E453),\"hie eu nix drischribu\",VLOOKUP(E453,'2026'!$A$16:$G$161,3,FALSE))","v":"Stallung Jäger & Tscherrig"}]
["2026-06-17",{"$f":"IF(ISBLANK(D454),\"Alain, nix drischribu\",VLOOKUP(D454,'2026'!$A$16:$G$161,3,FALSE))","v":"Stallung Jäger & Tscherrig"},{"$f":"VLOOKUP(D454,'2026'!$A$16:$B$161,2,FALSE)","v":"Fanny"},56,7,{"$f":"VLOOKUP(E454,'2026'!$A$16:$G$161,2,FALSE)","v":"Bilbao"},{"$f":"IF(ISBLANK(E454),\"hie eu nix drischribu\",VLOOKUP(E454,'2026'!$A$16:$G$161,3,FALSE))","v":"Bregy Alain"}]
["2026-06-17",{"$f":"IF(ISBLANK(D455),\"Alain, nix drischribu\",VLOOKUP(D455,'2026'!$A$16:$G$161,3,FALSE))","v":"Gebrüder Jäger"},{"$f":"VLOOKUP(D455,'2026'!$A$16:$B$161,2,FALSE)","v":"Soraya"},23,47,{"$f":"VLOOKUP(E455,'2026'!$A$16:$G$161,2,FALSE)","v":"Ramona"},{"$f":"IF(ISBLANK(E455),\"hie eu nix drischribu\",VLOOKUP(E455,'2026'!$A$16:$G$161,3,FALSE))","v":"Lauber Noah & Jonas"}]
["2026-06-17",{"$f":"IF(ISBLANK(D456),\"Alain, nix drischribu\",VLOOKUP(D456,'2026'!$A$16:$G$161,3,FALSE))","v":"Zumofen / Gattlen"},{"$f":"VLOOKUP(D456,'2026'!$A$16:$B$161,2,FALSE)","v":"Vergara"},91,17,{"$f":"VLOOKUP(E456,'2026'!$A$16:$G$161,2,FALSE)","v":"Panja"},{"$f":"IF(ISBLANK(E456),\"hie eu nix drischribu\",VLOOKUP(E456,'2026'!$A$16:$G$161,3,FALSE))","v":"Bregy Uli, Lisi & Pascal"}]
["2026-06-17",{"$f":"IF(ISBLANK(D457),\"Alain, nix drischribu\",VLOOKUP(D457,'2026'!$A$16:$G$161,3,FALSE))","v":"Williner Anton"},{"$f":"VLOOKUP(D457,'2026'!$A$16:$B$161,2,FALSE)","v":"Venus"},76,23,{"$f":"VLOOKUP(E457,'2026'!$A$16:$G$161,2,FALSE)","v":"Soraya"},{"$f":"IF(ISBLANK(E457),\"hie eu nix drischribu\",VLOOKUP(E457,'2026'!$A$16:$G$161,3,FALSE))","v":"Gebrüder Jäger"}]
["2026-06-17",{"$f":"IF(ISBLANK(D458),\"Alain, nix drischribu\",VLOOKUP(D458,'2026'!$A$16:$G$161,3,FALSE))","v":"Bregy Uli, Lisi & Pascal"},{"$f":"VLOOKUP(D458,'2026'!$A$16:$B$161,2,FALSE)","v":"Calina"},18,51,{"$f":"VLOOKUP(E458,'2026'!$A$16:$G$161,2,FALSE)","v":"Bijou"},{"$f":"IF(ISBLANK(E458),\"hie eu nix drischribu\",VLOOKUP(E458,'2026'!$A$16:$G$161,3,FALSE))","v":"Stallung Jäger & Tscherrig"}]
["2026-06-17",{"$f":"IF(ISBLANK(D459),\"Alain, nix drischribu\",VLOOKUP(D459,'2026'!$A$16:$G$161,3,FALSE))","v":"Zumofen / Gattlen"},{"$f":"VLOOKUP(D459,'2026'!$A$16:$B$161,2,FALSE)","v":"Valdeeze"},88,5,{"$f":"VLOOKUP(E459,'2026'!$A$16:$G$161,2,FALSE)","v":"Valerie"},{"$f":"IF(ISBLANK(E459),\"hie eu nix drischribu\",VLOOKUP(E459,'2026'!$A$16:$G$161,3,FALSE))","v":"Bayard Medard & Gustav"}]
["2026-06-17",{"$f":"IF(ISBLANK(D460),\"Alain, nix drischribu\",VLOOKUP(D460,'2026'!$A$16:$G$161,3,FALSE))","v":"Zumofen / Gattlen"},{"$f":"VLOOKUP(D460,'2026'!$A$16:$B$161,2,FALSE)","v":"Vergara"},91,25,{"$f":"VLOOKUP(E460,'2026'!$A$16:$G$161,2,FALSE)","v":"Tirana"},{"$f":"IF(ISBLANK(E460),\"hie eu nix drischribu\",VLOOKUP(E460,'2026'!$A$16:$G$161,3,FALSE))","v":"Gebrüder Jäger"}]
["2026-06-17",{"$f":"IF(ISBLANK(D461),\"Alain, nix drischribu\",VLOOKUP(D461,'2026'!$A$16:$G$161,3,FALSE))","v":"Bayard Jan"},{"$f":"VLOOKUP(D461,'2026'!$A$16:$B$161,2,FALSE)","v":"Vaya"},1,29,{"$f":"VLOOKUP(E461,'2026'!$A$16:$G$161,2,FALSE)","v":"Tequila"},{"$f":"IF(ISBLANK(E461),\"hie eu nix drischribu\",VLOOKUP(E461,'2026'!$A$16:$G$161,3,FALSE))","v":"Gebrüder Jäger"}]
["2026-06-17",{"$f":"IF(ISBLANK(D462),\"Alain, nix drischribu\",VLOOKUP(D462,'2026'!$A$16:$G$161,3,FALSE))","v":"Bregy Uli, Lisi & Pascal"},{"$f":"VLOOKUP(D462,'2026'!$A$16:$B$161,2,FALSE)","v":"Calina"},18,74,{"$f":"VLOOKUP(E462,'2026'!$A$16:$G$161,2,FALSE)","v":"Brunette"},{"$f":"IF(ISBLANK(E462),\"hie eu nix drischribu\",VLOOKUP(E462,'2026'!$A$16:$G$161,3,FALSE))","v":"Stallung Passeraub"}]
["2026-06-17",{"$f":"IF(ISBLANK(D463),\"Alain, nix drischribu\",VLOOKUP(D463,'2026'!$A$16:$G$161,3,FALSE))","v":"Zumofen / Gattlen"},{"$f":"VLOOKUP(D463,'2026'!$A$16:$B$161,2,FALSE)","v":"Farinelle"},93,17,{"$f":"VLOOKUP(E463,'2026'!$A$16:$G$161,2,FALSE)","v":"Panja"},{"$f":"IF(ISBLANK(E463),\"hie eu nix drischribu\",VLOOKUP(E463,'2026'!$A$16:$G$161,3,FALSE))","v":"Bregy Uli, Lisi & Pascal"}]
["2026-06-17",{"$f":"IF(ISBLANK(D464),\"Alain, nix drischribu\",VLOOKUP(D464,'2026'!$A$16:$G$161,3,FALSE))","v":"Stallung Jäger & Tscherrig"},{"$f":"VLOOKUP(D464,'2026'!$A$16:$B$161,2,FALSE)","v":"Samoa"},60,12,{"$f":"VLOOKUP(E464,'2026'!$A$16:$G$161,2,FALSE)","v":"Cara"},{"$f":"IF(ISBLANK(E464),\"hie eu nix drischribu\",VLOOKUP(E464,'2026'!$A$16:$G$161,3,FALSE))","v":"Bregy Uli, Lisi & Pascal"}]
["2026-06-17",{"$f":"IF(ISBLANK(D465),\"Alain, nix drischribu\",VLOOKUP(D465,'2026'!$A$16:$G$161,3,FALSE))","v":"Bregy Uli, Lisi & Pascal"},{"$f":"VLOOKUP(D465,'2026'!$A$16:$B$161,2,FALSE)","v":"Samba"},14,32,{"$f":"VLOOKUP(E465,'2026'!$A$16:$G$161,2,FALSE)","v":"Ceres"},{"$f":"IF(ISBLANK(E465),\"hie eu nix drischribu\",VLOOKUP(E465,'2026'!$A$16:$G$161,3,FALSE))","v":"Geschwister Lötscher"}]
["2026-06-16",{"$f":"IF(ISBLANK(D466),\"Alain, nix drischribu\",VLOOKUP(D466,'2026'!$A$16:$G$161,3,FALSE))","v":"Stallung Passeraub"},{"$f":"VLOOKUP(D466,'2026'!$A$16:$B$161,2,FALSE)","v":"Belle"},70,24,{"$f":"VLOOKUP(E466,'2026'!$A$16:$G$161,2,FALSE)","v":"Tamara"},{"$f":"IF(ISBLANK(E466),\"hie eu nix drischribu\",VLOOKUP(E466,'2026'!$A$16:$G$161,3,FALSE))","v":"Gebrüder Jäger"}]
["2026-06-16",{"$f":"IF(ISBLANK(D467),\"Alain, nix drischribu\",VLOOKUP(D467,'2026'!$A$16:$G$161,3,FALSE))","v":"Gebrüder Jäger"},{"$f":"VLOOKUP(D467,'2026'!$A$16:$B$161,2,FALSE)","v":"Soraya"},23,4,{"$f":"VLOOKUP(E467,'2026'!$A$16:$G$161,2,FALSE)","v":"Vampir"},{"$f":"IF(ISBLANK(E467),\"hie eu nix drischribu\",VLOOKUP(E467,'2026'!$A$16:$G$161,3,FALSE))","v":"Bayard Medard & Gustav"}]
["2026-06-16",{"$f":"IF(ISBLANK(D468),\"Alain, nix drischribu\",VLOOKUP(D468,'2026'!$A$16:$G$161,3,FALSE))","v":"Lötscher Sandrine & Cédric"},{"$f":"VLOOKUP(D468,'2026'!$A$16:$B$161,2,FALSE)","v":"Perle"},36,91,{"$f":"VLOOKUP(E468,'2026'!$A$16:$G$161,2,FALSE)","v":"Vergara"},{"$f":"IF(ISBLANK(E468),\"hie eu nix drischribu\",VLOOKUP(E468,'2026'!$A$16:$G$161,3,FALSE))","v":"Zumofen / Gattlen"}]
["2026-06-16",{"$f":"IF(ISBLANK(D469),\"Alain, nix drischribu\",VLOOKUP(D469,'2026'!$A$16:$G$161,3,FALSE))","v":"Zumofen / Gattlen"},{"$f":"VLOOKUP(D469,'2026'!$A$16:$B$161,2,FALSE)","v":"Vesuv"},84,10,{"$f":"VLOOKUP(E469,'2026'!$A$16:$G$161,2,FALSE)","v":"Perona"},{"$f":"IF(ISBLANK(E469),\"hie eu nix drischribu\",VLOOKUP(E469,'2026'!$A$16:$G$161,3,FALSE))","v":"Bregy Uli, Lisi & Pascal"}]
["2026-06-16",{"$f":"IF(ISBLANK(D470),\"Alain, nix drischribu\",VLOOKUP(D470,'2026'!$A$16:$G$161,3,FALSE))","v":"Hischier H. & Bühlmann J."},{"$f":"VLOOKUP(D470,'2026'!$A$16:$B$161,2,FALSE)","v":"Cayenne"},45,32,{"$f":"VLOOKUP(E470,'2026'!$A$16:$G$161,2,FALSE)","v":"Ceres"},{"$f":"IF(ISBLANK(E470),\"hie eu nix drischribu\",VLOOKUP(E470,'2026'!$A$16:$G$161,3,FALSE))","v":"Geschwister Lötscher"}]
["2026-06-16",{"$f":"IF(ISBLANK(D471),\"Alain, nix drischribu\",VLOOKUP(D471,'2026'!$A$16:$G$161,3,FALSE))","v":"Bregy Alain"},{"$f":"VLOOKUP(D471,'2026'!$A$16:$B$161,2,FALSE)","v":"Banja"},9,47,{"$f":"VLOOKUP(E471,'2026'!$A$16:$G$161,2,FALSE)","v":"Ramona"},{"$f":"IF(ISBLANK(E471),\"hie eu nix drischribu\",VLOOKUP(E471,'2026'!$A$16:$G$161,3,FALSE))","v":"Lauber Noah & Jonas"}]
["2026-06-16",{"$f":"IF(ISBLANK(D472),\"Alain, nix drischribu\",VLOOKUP(D472,'2026'!$A$16:$G$161,3,FALSE))","v":"Geschwister Lötscher"},{"$f":"VLOOKUP(D472,'2026'!$A$16:$B$161,2,FALSE)","v":"Cobra"},37,16,{"$f":"VLOOKUP(E472,'2026'!$A$16:$G$161,2,FALSE)","v":"Belle"},{"$f":"IF(ISBLANK(E472),\"hie eu nix drischribu\",VLOOKUP(E472,'2026'!$A$16:$G$161,3,FALSE))","v":"Bregy Uli, Lisi & Pascal"}]
["2026-06-16",{"$f":"IF(ISBLANK(D473),\"Alain, nix drischribu\",VLOOKUP(D473,'2026'!$A$16:$G$161,3,FALSE))","v":"Lauber Noah & Jonas"},{"$f":"VLOOKUP(D473,'2026'!$A$16:$B$161,2,FALSE)","v":"Cherico"},46,3,{"$f":"VLOOKUP(E473,'2026'!$A$16:$G$161,2,FALSE)","v":"Pegasus"},{"$f":"IF(ISBLANK(E473),\"hie eu nix drischribu\",VLOOKUP(E473,'2026'!$A$16:$G$161,3,FALSE))","v":"Bayard Medard & Gustav"}]
["2026-06-16",{"$f":"IF(ISBLANK(D474),\"Alain, nix drischribu\",VLOOKUP(D474,'2026'!$A$16:$G$161,3,FALSE))","v":"Bregy Uli, Lisi & Pascal"},{"$f":"VLOOKUP(D474,'2026'!$A$16:$B$161,2,FALSE)","v":"Belle"},16,38,{"$f":"VLOOKUP(E474,'2026'!$A$16:$G$161,2,FALSE)","v":"Casimir"},{"$f":"IF(ISBLANK(E474),\"hie eu nix drischribu\",VLOOKUP(E474,'2026'!$A$16:$G$161,3,FALSE))","v":"Geschwister Lötscher"}]
["2026-06-16",{"$f":"IF(ISBLANK(D475),\"Alain, nix drischribu\",VLOOKUP(D475,'2026'!$A$16:$G$161,3,FALSE))","v":"Lauber Noah & Jonas"},{"$f":"VLOOKUP(D475,'2026'!$A$16:$B$161,2,FALSE)","v":"Ramona"},47,35,{"$f":"VLOOKUP(E475,'2026'!$A$16:$G$161,2,FALSE)","v":"Cartouche"},{"$f":"IF(ISBLANK(E475),\"hie eu nix drischribu\",VLOOKUP(E475,'2026'!$A$16:$G$161,3,FALSE))","v":"Geschwister Lötscher"}]
["2026-06-16",{"$f":"IF(ISBLANK(D476),\"Alain, nix drischribu\",VLOOKUP(D476,'2026'!$A$16:$G$161,3,FALSE))","v":"Bregy Uli, Lisi & Pascal"},{"$f":"VLOOKUP(D476,'2026'!$A$16:$B$161,2,FALSE)","v":"Cara"},12,70,{"$f":"VLOOKUP(E476,'2026'!$A$16:$G$161,2,FALSE)","v":"Belle"},{"$f":"IF(ISBLANK(E476),\"hie eu nix drischribu\",VLOOKUP(E476,'2026'!$A$16:$G$161,3,FALSE))","v":"Stallung Passeraub"}]
["2026-06-16",{"$f":"IF(ISBLANK(D477),\"Alain, nix drischribu\",VLOOKUP(D477,'2026'!$A$16:$G$161,3,FALSE))","v":"Stallung Jäger & Tscherrig"},{"$f":"VLOOKUP(D477,'2026'!$A$16:$B$161,2,FALSE)","v":"Sina"},53,10,{"$f":"VLOOKUP(E477,'2026'!$A$16:$G$161,2,FALSE)","v":"Perona"},{"$f":"IF(ISBLANK(E477),\"hie eu nix drischribu\",VLOOKUP(E477,'2026'!$A$16:$G$161,3,FALSE))","v":"Bregy Uli, Lisi & Pascal"}]
["2026-06-16",{"$f":"IF(ISBLANK(D478),\"Alain, nix drischribu\",VLOOKUP(D478,'2026'!$A$16:$G$161,3,FALSE))","v":"Stallung Passeraub"},{"$f":"VLOOKUP(D478,'2026'!$A$16:$B$161,2,FALSE)","v":"Belana"},65,36,{"$f":"VLOOKUP(E478,'2026'!$A$16:$G$161,2,FALSE)","v":"Perle"},{"$f":"IF(ISBLANK(E478),\"hie eu nix drischribu\",VLOOKUP(E478,'2026'!$A$16:$G$161,3,FALSE))","v":"Lötscher Sandrine & Cédric"}]
["2026-06-16",{"$f":"IF(ISBLANK(D479),\"Alain, nix drischribu\",VLOOKUP(D479,'2026'!$A$16:$G$161,3,FALSE))","v":"Stallung Jäger & Tscherrig"},{"$f":"VLOOKUP(D479,'2026'!$A$16:$B$161,2,FALSE)","v":"Beline"},50,77,{"$f":"VLOOKUP(E479,'2026'!$A$16:$G$161,2,FALSE)","v":"Tirana"},{"$f":"IF(ISBLANK(E479),\"hie eu nix drischribu\",VLOOKUP(E479,'2026'!$A$16:$G$161,3,FALSE))","v":"Williner Anton"}]
["2026-06-16",{"$f":"IF(ISBLANK(D480),\"Alain, nix drischribu\",VLOOKUP(D480,'2026'!$A$16:$G$161,3,FALSE))","v":"Stallung Jäger & Tscherrig"},{"$f":"VLOOKUP(D480,'2026'!$A$16:$B$161,2,FALSE)","v":"Bogota"},57,27,{"$f":"VLOOKUP(E480,'2026'!$A$16:$G$161,2,FALSE)","v":"Silene"},{"$f":"IF(ISBLANK(E480),\"hie eu nix drischribu\",VLOOKUP(E480,'2026'!$A$16:$G$161,3,FALSE))","v":"Gebrüder Jäger"}]
["2026-06-16",{"$f":"IF(ISBLANK(D481),\"Alain, nix drischribu\",VLOOKUP(D481,'2026'!$A$16:$G$161,3,FALSE))","v":"Stallung Jäger & Tscherrig"},{"$f":"VLOOKUP(D481,'2026'!$A$16:$B$161,2,FALSE)","v":"Bogota"},57,28,{"$f":"VLOOKUP(E481,'2026'!$A$16:$G$161,2,FALSE)","v":"Luna"},{"$f":"IF(ISBLANK(E481),\"hie eu nix drischribu\",VLOOKUP(E481,'2026'!$A$16:$G$161,3,FALSE))","v":"Gebrüder Jäger"}]
["2026-06-16",{"$f":"IF(ISBLANK(D482),\"Alain, nix drischribu\",VLOOKUP(D482,'2026'!$A$16:$G$161,3,FALSE))","v":"Zumofen / Gattlen"},{"$f":"VLOOKUP(D482,'2026'!$A$16:$B$161,2,FALSE)","v":"Farinelle"},93,45,{"$f":"VLOOKUP(E482,'2026'!$A$16:$G$161,2,FALSE)","v":"Cayenne"},{"$f":"IF(ISBLANK(E482),\"hie eu nix drischribu\",VLOOKUP(E482,'2026'!$A$16:$G$161,3,FALSE))","v":"Hischier H. & Bühlmann J."}]
["2026-06-16",{"$f":"IF(ISBLANK(D483),\"Alain, nix drischribu\",VLOOKUP(D483,'2026'!$A$16:$G$161,3,FALSE))","v":"Zumofen / Gattlen"},{"$f":"VLOOKUP(D483,'2026'!$A$16:$B$161,2,FALSE)","v":"Vergara"},91,56,{"$f":"VLOOKUP(E483,'2026'!$A$16:$G$161,2,FALSE)","v":"Fanny"},{"$f":"IF(ISBLANK(E483),\"hie eu nix drischribu\",VLOOKUP(E483,'2026'!$A$16:$G$161,3,FALSE))","v":"Stallung Jäger & Tscherrig"}]
["2026-06-16",{"$f":"IF(ISBLANK(D484),\"Alain, nix drischribu\",VLOOKUP(D484,'2026'!$A$16:$G$161,3,FALSE))","v":"Bregy Uli, Lisi & Pascal"},{"$f":"VLOOKUP(D484,'2026'!$A$16:$B$161,2,FALSE)","v":"Samba"},14,91,{"$f":"VLOOKUP(E484,'2026'!$A$16:$G$161,2,FALSE)","v":"Vergara"},{"$f":"IF(ISBLANK(E484),\"hie eu nix drischribu\",VLOOKUP(E484,'2026'!$A$16:$G$161,3,FALSE))","v":"Zumofen / Gattlen"}]
["2026-06-16",{"$f":"IF(ISBLANK(D485),\"Alain, nix drischribu\",VLOOKUP(D485,'2026'!$A$16:$G$161,3,FALSE))","v":"Stallung Jäger & Tscherrig"},{"$f":"VLOOKUP(D485,'2026'!$A$16:$B$161,2,FALSE)","v":"Pixel"},58,34,{"$f":"VLOOKUP(E485,'2026'!$A$16:$G$161,2,FALSE)","v":"Mesquine"},{"$f":"IF(ISBLANK(E485),\"hie eu nix drischribu\",VLOOKUP(E485,'2026'!$A$16:$G$161,3,FALSE))","v":"Lötscher Sandrine & Cédric"}]
["2026-06-16",{"$f":"IF(ISBLANK(D486),\"Alain, nix drischribu\",VLOOKUP(D486,'2026'!$A$16:$G$161,3,FALSE))","v":"Stallung Jäger & Tscherrig"},{"$f":"VLOOKUP(D486,'2026'!$A$16:$B$161,2,FALSE)","v":"Sina"},53,76,{"$f":"VLOOKUP(E486,'2026'!$A$16:$G$161,2,FALSE)","v":"Venus"},{"$f":"IF(ISBLANK(E486),\"hie eu nix drischribu\",VLOOKUP(E486,'2026'!$A$16:$G$161,3,FALSE))","v":"Williner Anton"}]
["2026-06-16",{"$f":"IF(ISBLANK(D487),\"Alain, nix drischribu\",VLOOKUP(D487,'2026'!$A$16:$G$161,3,FALSE))","v":"Zumofen / Gattlen"},{"$f":"VLOOKUP(D487,'2026'!$A$16:$B$161,2,FALSE)","v":"Farinelle"},93,35,{"$f":"VLOOKUP(E487,'2026'!$A$16:$G$161,2,FALSE)","v":"Cartouche"},{"$f":"IF(ISBLANK(E487),\"hie eu nix drischribu\",VLOOKUP(E487,'2026'!$A$16:$G$161,3,FALSE))","v":"Geschwister Lötscher"}]
["2026-06-16",{"$f":"IF(ISBLANK(D488),\"Alain, nix drischribu\",VLOOKUP(D488,'2026'!$A$16:$G$161,3,FALSE))","v":"Gebrüder Jäger"},{"$f":"VLOOKUP(D488,'2026'!$A$16:$B$161,2,FALSE)","v":"Luna"},28,56,{"$f":"VLOOKUP(E488,'2026'!$A$16:$G$161,2,FALSE)","v":"Fanny"},{"$f":"IF(ISBLANK(E488),\"hie eu nix drischribu\",VLOOKUP(E488,'2026'!$A$16:$G$161,3,FALSE))","v":"Stallung Jäger & Tscherrig"}]
["2026-06-16",{"$f":"IF(ISBLANK(D489),\"Alain, nix drischribu\",VLOOKUP(D489,'2026'!$A$16:$G$161,3,FALSE))","v":"Lötscher Sandrine & Cédric"},{"$f":"VLOOKUP(D489,'2026'!$A$16:$B$161,2,FALSE)","v":"Pouki"},33,88,{"$f":"VLOOKUP(E489,'2026'!$A$16:$G$161,2,FALSE)","v":"Valdeeze"},{"$f":"IF(ISBLANK(E489),\"hie eu nix drischribu\",VLOOKUP(E489,'2026'!$A$16:$G$161,3,FALSE))","v":"Zumofen / Gattlen"}]
["2026-06-16",{"$f":"IF(ISBLANK(D490),\"Alain, nix drischribu\",VLOOKUP(D490,'2026'!$A$16:$G$161,3,FALSE))","v":"Bayard Medard & Gustav"},{"$f":"VLOOKUP(D490,'2026'!$A$16:$B$161,2,FALSE)","v":"Vampir"},4,87,{"$f":"VLOOKUP(E490,'2026'!$A$16:$G$161,2,FALSE)","v":"Fame"},{"$f":"IF(ISBLANK(E490),\"hie eu nix drischribu\",VLOOKUP(E490,'2026'!$A$16:$G$161,3,FALSE))","v":"Zumofen / Gattlen"}]
["2026-06-16",{"$f":"IF(ISBLANK(D491),\"Alain, nix drischribu\",VLOOKUP(D491,'2026'!$A$16:$G$161,3,FALSE))","v":"Stallung Jäger & Tscherrig"},{"$f":"VLOOKUP(D491,'2026'!$A$16:$B$161,2,FALSE)","v":"Metis"},48,89,{"$f":"VLOOKUP(E491,'2026'!$A$16:$G$161,2,FALSE)","v":"Verygood"},{"$f":"IF(ISBLANK(E491),\"hie eu nix drischribu\",VLOOKUP(E491,'2026'!$A$16:$G$161,3,FALSE))","v":"Zumofen / Gattlen"}]
["2026-06-16",{"$f":"IF(ISBLANK(D492),\"Alain, nix drischribu\",VLOOKUP(D492,'2026'!$A$16:$G$161,3,FALSE))","v":"Stallung Passeraub"},{"$f":"VLOOKUP(D492,'2026'!$A$16:$B$161,2,FALSE)","v":"Beluga"},66,22,{"$f":"VLOOKUP(E492,'2026'!$A$16:$G$161,2,FALSE)","v":"Tyson"},{"$f":"IF(ISBLANK(E492),\"hie eu nix drischribu\",VLOOKUP(E492,'2026'!$A$16:$G$161,3,FALSE))","v":"Familie Leiggener"}]
["2026-06-16",{"$f":"IF(ISBLANK(D493),\"Alain, nix drischribu\",VLOOKUP(D493,'2026'!$A$16:$G$161,3,FALSE))","v":"Stallung Passeraub"},{"$f":"VLOOKUP(D493,'2026'!$A$16:$B$161,2,FALSE)","v":"Beluga"},66,77,{"$f":"VLOOKUP(E493,'2026'!$A$16:$G$161,2,FALSE)","v":"Tirana"},{"$f":"IF(ISBLANK(E493),\"hie eu nix drischribu\",VLOOKUP(E493,'2026'!$A$16:$G$161,3,FALSE))","v":"Williner Anton"}]
["2026-06-16",{"$f":"IF(ISBLANK(D494),\"Alain, nix drischribu\",VLOOKUP(D494,'2026'!$A$16:$G$161,3,FALSE))","v":"Familie Leiggener"},{"$f":"VLOOKUP(D494,'2026'!$A$16:$B$161,2,FALSE)","v":"Colette"},19,58,{"$f":"VLOOKUP(E494,'2026'!$A$16:$G$161,2,FALSE)","v":"Pixel"},{"$f":"IF(ISBLANK(E494),\"hie eu nix drischribu\",VLOOKUP(E494,'2026'!$A$16:$G$161,3,FALSE))","v":"Stallung Jäger & Tscherrig"}]
["2026-06-16",{"$f":"IF(ISBLANK(D495),\"Alain, nix drischribu\",VLOOKUP(D495,'2026'!$A$16:$G$161,3,FALSE))","v":"Stallung Jäger & Tscherrig"},{"$f":"VLOOKUP(D495,'2026'!$A$16:$B$161,2,FALSE)","v":"Myla"},55,19,{"$f":"VLOOKUP(E495,'2026'!$A$16:$G$161,2,FALSE)","v":"Colette"},{"$f":"IF(ISBLANK(E495),\"hie eu nix drischribu\",VLOOKUP(E495,'2026'!$A$16:$G$161,3,FALSE))","v":"Familie Leiggener"}]
["2026-06-16",{"$f":"IF(ISBLANK(D496),\"Alain, nix drischribu\",VLOOKUP(D496,'2026'!$A$16:$G$161,3,FALSE))","v":"Williner Anton"},{"$f":"VLOOKUP(D496,'2026'!$A$16:$B$161,2,FALSE)","v":"Tirana"},77,43,{"$f":"VLOOKUP(E496,'2026'!$A$16:$G$161,2,FALSE)","v":"Baghira"},{"$f":"IF(ISBLANK(E496),\"hie eu nix drischribu\",VLOOKUP(E496,'2026'!$A$16:$G$161,3,FALSE))","v":"Hischier H. & Bühlmann J."}]
["2026-06-16",{"$f":"IF(ISBLANK(D497),\"Alain, nix drischribu\",VLOOKUP(D497,'2026'!$A$16:$G$161,3,FALSE))","v":"Bregy Uli, Lisi & Pascal"},{"$f":"VLOOKUP(D497,'2026'!$A$16:$B$161,2,FALSE)","v":"Perona"},10,9,{"$f":"VLOOKUP(E497,'2026'!$A$16:$G$161,2,FALSE)","v":"Banja"},{"$f":"IF(ISBLANK(E497),\"hie eu nix drischribu\",VLOOKUP(E497,'2026'!$A$16:$G$161,3,FALSE))","v":"Bregy Alain"}]
["2026-06-16",{"$f":"IF(ISBLANK(D498),\"Alain, nix drischribu\",VLOOKUP(D498,'2026'!$A$16:$G$161,3,FALSE))","v":"Bregy Uli, Lisi & Pascal"},{"$f":"VLOOKUP(D498,'2026'!$A$16:$B$161,2,FALSE)","v":"Perona"},10,6,{"$f":"VLOOKUP(E498,'2026'!$A$16:$G$161,2,FALSE)","v":"Cataille"},{"$f":"IF(ISBLANK(E498),\"hie eu nix drischribu\",VLOOKUP(E498,'2026'!$A$16:$G$161,3,FALSE))","v":"Bregy Alain"}]
["2026-06-16",{"$f":"IF(ISBLANK(D499),\"Alain, nix drischribu\",VLOOKUP(D499,'2026'!$A$16:$G$161,3,FALSE))","v":"Zumofen / Gattlen"},{"$f":"VLOOKUP(D499,'2026'!$A$16:$B$161,2,FALSE)","v":"Valdeeze"},88,36,{"$f":"VLOOKUP(E499,'2026'!$A$16:$G$161,2,FALSE)","v":"Perle"},{"$f":"IF(ISBLANK(E499),\"hie eu nix drischribu\",VLOOKUP(E499,'2026'!$A$16:$G$161,3,FALSE))","v":"Lötscher Sandrine & Cédric"}]
["2026-06-16",{"$f":"IF(ISBLANK(D500),\"Alain, nix drischribu\",VLOOKUP(D500,'2026'!$A$16:$G$161,3,FALSE))","v":"Bregy Uli, Lisi & Pascal"},{"$f":"VLOOKUP(D500,'2026'!$A$16:$B$161,2,FALSE)","v":"Belle"},16,39,{"$f":"VLOOKUP(E500,'2026'!$A$16:$G$161,2,FALSE)","v":"Chips"},{"$f":"IF(ISBLANK(E500),\"hie eu nix drischribu\",VLOOKUP(E500,'2026'!$A$16:$G$161,3,FALSE))","v":"Geschwister Lötscher"}]
["2026-06-16",{"$f":"IF(ISBLANK(D501),\"Alain, nix drischribu\",VLOOKUP(D501,'2026'!$A$16:$G$161,3,FALSE))","v":"Lötscher Sandrine & Cédric"},{"$f":"VLOOKUP(D501,'2026'!$A$16:$B$161,2,FALSE)","v":"Perle"},36,19,{"$f":"VLOOKUP(E501,'2026'!$A$16:$G$161,2,FALSE)","v":"Colette"},{"$f":"IF(ISBLANK(E501),\"hie eu nix drischribu\",VLOOKUP(E501,'2026'!$A$16:$G$161,3,FALSE))","v":"Familie Leiggener"}]
["2026-06-16",{"$f":"IF(ISBLANK(D502),\"Alain, nix drischribu\",VLOOKUP(D502,'2026'!$A$16:$G$161,3,FALSE))","v":"Lötscher Sandrine & Cédric"},{"$f":"VLOOKUP(D502,'2026'!$A$16:$B$161,2,FALSE)","v":"Perle"},36,15,{"$f":"VLOOKUP(E502,'2026'!$A$16:$G$161,2,FALSE)","v":"Souma"},{"$f":"IF(ISBLANK(E502),\"hie eu nix drischribu\",VLOOKUP(E502,'2026'!$A$16:$G$161,3,FALSE))","v":"Bregy Uli, Lisi & Pascal"}]
["2026-06-16",{"$f":"IF(ISBLANK(D503),\"Alain, nix drischribu\",VLOOKUP(D503,'2026'!$A$16:$G$161,3,FALSE))","v":"Stallung Jäger & Tscherrig"},{"$f":"VLOOKUP(D503,'2026'!$A$16:$B$161,2,FALSE)","v":"Metis"},48,65,{"$f":"VLOOKUP(E503,'2026'!$A$16:$G$161,2,FALSE)","v":"Belana"},{"$f":"IF(ISBLANK(E503),\"hie eu nix drischribu\",VLOOKUP(E503,'2026'!$A$16:$G$161,3,FALSE))","v":"Stallung Passeraub"}]
["2026-06-16",{"$f":"IF(ISBLANK(D504),\"Alain, nix drischribu\",VLOOKUP(D504,'2026'!$A$16:$G$161,3,FALSE))","v":"Familie Leiggener"},{"$f":"VLOOKUP(D504,'2026'!$A$16:$B$161,2,FALSE)","v":"Tyson"},22,46,{"$f":"VLOOKUP(E504,'2026'!$A$16:$G$161,2,FALSE)","v":"Cherico"},{"$f":"IF(ISBLANK(E504),\"hie eu nix drischribu\",VLOOKUP(E504,'2026'!$A$16:$G$161,3,FALSE))","v":"Lauber Noah & Jonas"}]
["2026-06-16",{"$f":"IF(ISBLANK(D505),\"Alain, nix drischribu\",VLOOKUP(D505,'2026'!$A$16:$G$161,3,FALSE))","v":"Stallung Jäger & Tscherrig"},{"$f":"VLOOKUP(D505,'2026'!$A$16:$B$161,2,FALSE)","v":"Sina"},53,10,{"$f":"VLOOKUP(E505,'2026'!$A$16:$G$161,2,FALSE)","v":"Perona"},{"$f":"IF(ISBLANK(E505),\"hie eu nix drischribu\",VLOOKUP(E505,'2026'!$A$16:$G$161,3,FALSE))","v":"Bregy Uli, Lisi & Pascal"}]
["2026-06-16",{"$f":"IF(ISBLANK(D506),\"Alain, nix drischribu\",VLOOKUP(D506,'2026'!$A$16:$G$161,3,FALSE))","v":"Bregy Uli, Lisi & Pascal"},{"$f":"VLOOKUP(D506,'2026'!$A$16:$B$161,2,FALSE)","v":"Cara"},12,60,{"$f":"VLOOKUP(E506,'2026'!$A$16:$G$161,2,FALSE)","v":"Samoa"},{"$f":"IF(ISBLANK(E506),\"hie eu nix drischribu\",VLOOKUP(E506,'2026'!$A$16:$G$161,3,FALSE))","v":"Stallung Jäger & Tscherrig"}]
["2026-06-16",{"$f":"IF(ISBLANK(D507),\"Alain, nix drischribu\",VLOOKUP(D507,'2026'!$A$16:$G$161,3,FALSE))","v":"Stallung Passeraub"},{"$f":"VLOOKUP(D507,'2026'!$A$16:$B$161,2,FALSE)","v":"Belana"},65,57,{"$f":"VLOOKUP(E507,'2026'!$A$16:$G$161,2,FALSE)","v":"Bogota"},{"$f":"IF(ISBLANK(E507),\"hie eu nix drischribu\",VLOOKUP(E507,'2026'!$A$16:$G$161,3,FALSE))","v":"Stallung Jäger & Tscherrig"}]
["2026-06-16",{"$f":"IF(ISBLANK(D508),\"Alain, nix drischribu\",VLOOKUP(D508,'2026'!$A$16:$G$161,3,FALSE))","v":"Bregy Uli, Lisi & Pascal"},{"$f":"VLOOKUP(D508,'2026'!$A$16:$B$161,2,FALSE)","v":"Cara"},12,40,{"$f":"VLOOKUP(E508,'2026'!$A$16:$G$161,2,FALSE)","v":"Pandora"},{"$f":"IF(ISBLANK(E508),\"hie eu nix drischribu\",VLOOKUP(E508,'2026'!$A$16:$G$161,3,FALSE))","v":"Lötscher Sandrine & Cédric"}]
["2026-06-16",{"$f":"IF(ISBLANK(D509),\"Alain, nix drischribu\",VLOOKUP(D509,'2026'!$A$16:$G$161,3,FALSE))","v":"Zumofen / Gattlen"},{"$f":"VLOOKUP(D509,'2026'!$A$16:$B$161,2,FALSE)","v":"Roquette"},86,69,{"$f":"VLOOKUP(E509,'2026'!$A$16:$G$161,2,FALSE)","v":"Bandera"},{"$f":"IF(ISBLANK(E509),\"hie eu nix drischribu\",VLOOKUP(E509,'2026'!$A$16:$G$161,3,FALSE))","v":"Stallung Passeraub"}]
["2026-06-16",{"$f":"IF(ISBLANK(D510),\"Alain, nix drischribu\",VLOOKUP(D510,'2026'!$A$16:$G$161,3,FALSE))","v":"Stallung Jäger & Tscherrig"},{"$f":"VLOOKUP(D510,'2026'!$A$16:$B$161,2,FALSE)","v":"Metis"},48,30,{"$f":"VLOOKUP(E510,'2026'!$A$16:$G$161,2,FALSE)","v":"Tamango"},{"$f":"IF(ISBLANK(E510),\"hie eu nix drischribu\",VLOOKUP(E510,'2026'!$A$16:$G$161,3,FALSE))","v":"Gebrüder Jäger"}]
["2026-06-16",{"$f":"IF(ISBLANK(D511),\"Alain, nix drischribu\",VLOOKUP(D511,'2026'!$A$16:$G$161,3,FALSE))","v":"Stallung Passeraub"},{"$f":"VLOOKUP(D511,'2026'!$A$16:$B$161,2,FALSE)","v":"Beluga"},66,52,{"$f":"VLOOKUP(E511,'2026'!$A$16:$G$161,2,FALSE)","v":"Santana"},{"$f":"IF(ISBLANK(E511),\"hie eu nix drischribu\",VLOOKUP(E511,'2026'!$A$16:$G$161,3,FALSE))","v":"Stallung Jäger & Tscherrig"}]
["2026-06-16",{"$f":"IF(ISBLANK(D512),\"Alain, nix drischribu\",VLOOKUP(D512,'2026'!$A$16:$G$161,3,FALSE))","v":"Stallung Jäger & Tscherrig"},{"$f":"VLOOKUP(D512,'2026'!$A$16:$B$161,2,FALSE)","v":"Samba"},49,86,{"$f":"VLOOKUP(E512,'2026'!$A$16:$G$161,2,FALSE)","v":"Roquette"},{"$f":"IF(ISBLANK(E512),\"hie eu nix drischribu\",VLOOKUP(E512,'2026'!$A$16:$G$161,3,FALSE))","v":"Zumofen / Gattlen"}]
["2026-06-16",{"$f":"IF(ISBLANK(D513),\"Alain, nix drischribu\",VLOOKUP(D513,'2026'!$A$16:$G$161,3,FALSE))","v":"Gebrüder Jäger"},{"$f":"VLOOKUP(D513,'2026'!$A$16:$B$161,2,FALSE)","v":"Tequila"},29,78,{"$f":"VLOOKUP(E513,'2026'!$A$16:$G$161,2,FALSE)","v":"Timba"},{"$f":"IF(ISBLANK(E513),\"hie eu nix drischribu\",VLOOKUP(E513,'2026'!$A$16:$G$161,3,FALSE))","v":"Williner Anton"}]
["2026-06-16",{"$f":"IF(ISBLANK(D514),\"Alain, nix drischribu\",VLOOKUP(D514,'2026'!$A$16:$G$161,3,FALSE))","v":"Zumofen / Gattlen"},{"$f":"VLOOKUP(D514,'2026'!$A$16:$B$161,2,FALSE)","v":"Farinelle"},93,45,{"$f":"VLOOKUP(E514,'2026'!$A$16:$G$161,2,FALSE)","v":"Cayenne"},{"$f":"IF(ISBLANK(E514),\"hie eu nix drischribu\",VLOOKUP(E514,'2026'!$A$16:$G$161,3,FALSE))","v":"Hischier H. & Bühlmann J."}]
["2026-06-16",{"$f":"IF(ISBLANK(D515),\"Alain, nix drischribu\",VLOOKUP(D515,'2026'!$A$16:$G$161,3,FALSE))","v":"Stallung Jäger & Tscherrig"},{"$f":"VLOOKUP(D515,'2026'!$A$16:$B$161,2,FALSE)","v":"Pinga"},54,92,{"$f":"VLOOKUP(E515,'2026'!$A$16:$G$161,2,FALSE)","v":"Roseau"},{"$f":"IF(ISBLANK(E515),\"hie eu nix drischribu\",VLOOKUP(E515,'2026'!$A$16:$G$161,3,FALSE))","v":"Zumofen / Gattlen"}]
["2026-06-16",{"$f":"IF(ISBLANK(D516),\"Alain, nix drischribu\",VLOOKUP(D516,'2026'!$A$16:$G$161,3,FALSE))","v":"Lauber Noah & Jonas"},{"$f":"VLOOKUP(D516,'2026'!$A$16:$B$161,2,FALSE)","v":"Ramona"},47,40,{"$f":"VLOOKUP(E516,'2026'!$A$16:$G$161,2,FALSE)","v":"Pandora"},{"$f":"IF(ISBLANK(E516),\"hie eu nix drischribu\",VLOOKUP(E516,'2026'!$A$16:$G$161,3,FALSE))","v":"Lötscher Sandrine & Cédric"}]
["2026-06-16",{"$f":"IF(ISBLANK(D517),\"Alain, nix drischribu\",VLOOKUP(D517,'2026'!$A$16:$G$161,3,FALSE))","v":"Stallung Passeraub"},{"$f":"VLOOKUP(D517,'2026'!$A$16:$B$161,2,FALSE)","v":"Beluga"},66,55,{"$f":"VLOOKUP(E517,'2026'!$A$16:$G$161,2,FALSE)","v":"Myla"},{"$f":"IF(ISBLANK(E517),\"hie eu nix drischribu\",VLOOKUP(E517,'2026'!$A$16:$G$161,3,FALSE))","v":"Stallung Jäger & Tscherrig"}]
["2026-06-16",{"$f":"IF(ISBLANK(D518),\"Alain, nix drischribu\",VLOOKUP(D518,'2026'!$A$16:$G$161,3,FALSE))","v":"Gebrüder Jäger"},{"$f":"VLOOKUP(D518,'2026'!$A$16:$B$161,2,FALSE)","v":"Luna"},28,74,{"$f":"VLOOKUP(E518,'2026'!$A$16:$G$161,2,FALSE)","v":"Brunette"},{"$f":"IF(ISBLANK(E518),\"hie eu nix drischribu\",VLOOKUP(E518,'2026'!$A$16:$G$161,3,FALSE))","v":"Stallung Passeraub"}]
["2026-06-16",{"$f":"IF(ISBLANK(D519),\"Alain, nix drischribu\",VLOOKUP(D519,'2026'!$A$16:$G$161,3,FALSE))","v":"Gebrüder Jäger"},{"$f":"VLOOKUP(D519,'2026'!$A$16:$B$161,2,FALSE)","v":"Betty Boop"},26,30,{"$f":"VLOOKUP(E519,'2026'!$A$16:$G$161,2,FALSE)","v":"Tamango"},{"$f":"IF(ISBLANK(E519),\"hie eu nix drischribu\",VLOOKUP(E519,'2026'!$A$16:$G$161,3,FALSE))","v":"Gebrüder Jäger"}]
["2026-06-16",{"$f":"IF(ISBLANK(D520),\"Alain, nix drischribu\",VLOOKUP(D520,'2026'!$A$16:$G$161,3,FALSE))","v":"Stallung Passeraub"},{"$f":"VLOOKUP(D520,'2026'!$A$16:$B$161,2,FALSE)","v":"Malice"},73,91,{"$f":"VLOOKUP(E520,'2026'!$A$16:$G$161,2,FALSE)","v":"Vergara"},{"$f":"IF(ISBLANK(E520),\"hie eu nix drischribu\",VLOOKUP(E520,'2026'!$A$16:$G$161,3,FALSE))","v":"Zumofen / Gattlen"}]
["2026-06-16",{"$f":"IF(ISBLANK(D521),\"Alain, nix drischribu\",VLOOKUP(D521,'2026'!$A$16:$G$161,3,FALSE))","v":"Zumofen / Gattlen"},{"$f":"VLOOKUP(D521,'2026'!$A$16:$B$161,2,FALSE)","v":"Vergara"},91,68,{"$f":"VLOOKUP(E521,'2026'!$A$16:$G$161,2,FALSE)","v":"Bolienne"},{"$f":"IF(ISBLANK(E521),\"hie eu nix drischribu\",VLOOKUP(E521,'2026'!$A$16:$G$161,3,FALSE))","v":"Stallung Passeraub"}]
["2026-06-16",{"$f":"IF(ISBLANK(D522),\"Alain, nix drischribu\",VLOOKUP(D522,'2026'!$A$16:$G$161,3,FALSE))","v":"Stallung Passeraub"},{"$f":"VLOOKUP(D522,'2026'!$A$16:$B$161,2,FALSE)","v":"Bolienne"},68,93,{"$f":"VLOOKUP(E522,'2026'!$A$16:$G$161,2,FALSE)","v":"Farinelle"},{"$f":"IF(ISBLANK(E522),\"hie eu nix drischribu\",VLOOKUP(E522,'2026'!$A$16:$G$161,3,FALSE))","v":"Zumofen / Gattlen"}]
["2026-06-16",{"$f":"IF(ISBLANK(D523),\"Alain, nix drischribu\",VLOOKUP(D523,'2026'!$A$16:$G$161,3,FALSE))","v":"Stallung Passeraub"},{"$f":"VLOOKUP(D523,'2026'!$A$16:$B$161,2,FALSE)","v":"Boriana"},67,50,{"$f":"VLOOKUP(E523,'2026'!$A$16:$G$161,2,FALSE)","v":"Beline"},{"$f":"IF(ISBLANK(E523),\"hie eu nix drischribu\",VLOOKUP(E523,'2026'!$A$16:$G$161,3,FALSE))","v":"Stallung Jäger & Tscherrig"}]
["2026-06-16",{"$f":"IF(ISBLANK(D524),\"Alain, nix drischribu\",VLOOKUP(D524,'2026'!$A$16:$G$161,3,FALSE))","v":"Stallung Jäger & Tscherrig"},{"$f":"VLOOKUP(D524,'2026'!$A$16:$B$161,2,FALSE)","v":"Myla"},55,71,{"$f":"VLOOKUP(E524,'2026'!$A$16:$G$161,2,FALSE)","v":"Fiona"},{"$f":"IF(ISBLANK(E524),\"hie eu nix drischribu\",VLOOKUP(E524,'2026'!$A$16:$G$161,3,FALSE))","v":"Hutter Richard"}]
["2026-06-16",{"$f":"IF(ISBLANK(D525),\"Alain, nix drischribu\",VLOOKUP(D525,'2026'!$A$16:$G$161,3,FALSE))","v":"Stallung Jäger & Tscherrig"},{"$f":"VLOOKUP(D525,'2026'!$A$16:$B$161,2,FALSE)","v":"Beline"},50,71,{"$f":"VLOOKUP(E525,'2026'!$A$16:$G$161,2,FALSE)","v":"Fiona"},{"$f":"IF(ISBLANK(E525),\"hie eu nix drischribu\",VLOOKUP(E525,'2026'!$A$16:$G$161,3,FALSE))","v":"Hutter Richard"}]
["2026-06-16",{"$f":"IF(ISBLANK(D526),\"Alain, nix drischribu\",VLOOKUP(D526,'2026'!$A$16:$G$161,3,FALSE))","v":"Zumofen / Gattlen"},{"$f":"VLOOKUP(D526,'2026'!$A$16:$B$161,2,FALSE)","v":"Vergara"},91,71,{"$f":"VLOOKUP(E526,'2026'!$A$16:$G$161,2,FALSE)","v":"Fiona"},{"$f":"IF(ISBLANK(E526),\"hie eu nix drischribu\",VLOOKUP(E526,'2026'!$A$16:$G$161,3,FALSE))","v":"Hutter Richard"}]
["2026-06-16",{"$f":"IF(ISBLANK(D527),\"Alain, nix drischribu\",VLOOKUP(D527,'2026'!$A$16:$G$161,3,FALSE))","v":"Stallung Jäger & Tscherrig"},{"$f":"VLOOKUP(D527,'2026'!$A$16:$B$161,2,FALSE)","v":"Sina"},53,73,{"$f":"VLOOKUP(E527,'2026'!$A$16:$G$161,2,FALSE)","v":"Malice"},{"$f":"IF(ISBLANK(E527),\"hie eu nix drischribu\",VLOOKUP(E527,'2026'!$A$16:$G$161,3,FALSE))","v":"Stallung Passeraub"}]
["2026-06-16",{"$f":"IF(ISBLANK(D528),\"Alain, nix drischribu\",VLOOKUP(D528,'2026'!$A$16:$G$161,3,FALSE))","v":"Stallung Jäger & Tscherrig"},{"$f":"VLOOKUP(D528,'2026'!$A$16:$B$161,2,FALSE)","v":"Medusa"},59,62,{"$f":"VLOOKUP(E528,'2026'!$A$16:$G$161,2,FALSE)","v":"Xenia"},{"$f":"IF(ISBLANK(E528),\"hie eu nix drischribu\",VLOOKUP(E528,'2026'!$A$16:$G$161,3,FALSE))","v":"Stallung Mussmann"}]
["2026-06-15",{"$f":"IF(ISBLANK(D529),\"Alain, nix drischribu\",VLOOKUP(D529,'2026'!$A$16:$G$161,3,FALSE))","v":"Bregy Alain"},{"$f":"VLOOKUP(D529,'2026'!$A$16:$B$161,2,FALSE)","v":"Banja"},9,56,{"$f":"VLOOKUP(E529,'2026'!$A$16:$G$161,2,FALSE)","v":"Fanny"},{"$f":"IF(ISBLANK(E529),\"hie eu nix drischribu\",VLOOKUP(E529,'2026'!$A$16:$G$161,3,FALSE))","v":"Stallung Jäger & Tscherrig"}]
["2026-06-15",{"$f":"IF(ISBLANK(D530),\"Alain, nix drischribu\",VLOOKUP(D530,'2026'!$A$16:$G$161,3,FALSE))","v":"Stallung Jäger & Tscherrig"},{"$f":"VLOOKUP(D530,'2026'!$A$16:$B$161,2,FALSE)","v":"Puma"},61,78,{"$f":"VLOOKUP(E530,'2026'!$A$16:$G$161,2,FALSE)","v":"Timba"},{"$f":"IF(ISBLANK(E530),\"hie eu nix drischribu\",VLOOKUP(E530,'2026'!$A$16:$G$161,3,FALSE))","v":"Williner Anton"}]
["2026-06-15",{"$f":"IF(ISBLANK(D531),\"Alain, nix drischribu\",VLOOKUP(D531,'2026'!$A$16:$G$161,3,FALSE))","v":"Stallung Jäger & Tscherrig"},{"$f":"VLOOKUP(D531,'2026'!$A$16:$B$161,2,FALSE)","v":"Bogota"},57,35,{"$f":"VLOOKUP(E531,'2026'!$A$16:$G$161,2,FALSE)","v":"Cartouche"},{"$f":"IF(ISBLANK(E531),\"hie eu nix drischribu\",VLOOKUP(E531,'2026'!$A$16:$G$161,3,FALSE))","v":"Geschwister Lötscher"}]
["2026-06-15",{"$f":"IF(ISBLANK(D532),\"Alain, nix drischribu\",VLOOKUP(D532,'2026'!$A$16:$G$161,3,FALSE))","v":"Stallung Jäger & Tscherrig"},{"$f":"VLOOKUP(D532,'2026'!$A$16:$B$161,2,FALSE)","v":"Myla"},55,64,{"$f":"VLOOKUP(E532,'2026'!$A$16:$G$161,2,FALSE)","v":"Bonita"},{"$f":"IF(ISBLANK(E532),\"hie eu nix drischribu\",VLOOKUP(E532,'2026'!$A$16:$G$161,3,FALSE))","v":"Stallung Passeraub"}]
["2026-06-15",{"$f":"IF(ISBLANK(D533),\"Alain, nix drischribu\",VLOOKUP(D533,'2026'!$A$16:$G$161,3,FALSE))","v":"Bregy Alain"},{"$f":"VLOOKUP(D533,'2026'!$A$16:$B$161,2,FALSE)","v":"Cataille"},6,60,{"$f":"VLOOKUP(E533,'2026'!$A$16:$G$161,2,FALSE)","v":"Samoa"},{"$f":"IF(ISBLANK(E533),\"hie eu nix drischribu\",VLOOKUP(E533,'2026'!$A$16:$G$161,3,FALSE))","v":"Stallung Jäger & Tscherrig"}]
["2026-06-15",{"$f":"IF(ISBLANK(D534),\"Alain, nix drischribu\",VLOOKUP(D534,'2026'!$A$16:$G$161,3,FALSE))","v":"Zumofen / Gattlen"},{"$f":"VLOOKUP(D534,'2026'!$A$16:$B$161,2,FALSE)","v":"Roquette"},86,65,{"$f":"VLOOKUP(E534,'2026'!$A$16:$G$161,2,FALSE)","v":"Belana"},{"$f":"IF(ISBLANK(E534),\"hie eu nix drischribu\",VLOOKUP(E534,'2026'!$A$16:$G$161,3,FALSE))","v":"Stallung Passeraub"}]
["2026-06-15",{"$f":"IF(ISBLANK(D535),\"Alain, nix drischribu\",VLOOKUP(D535,'2026'!$A$16:$G$161,3,FALSE))","v":"Lötscher Sandrine & Cédric"},{"$f":"VLOOKUP(D535,'2026'!$A$16:$B$161,2,FALSE)","v":"Pouki"},33,7,{"$f":"VLOOKUP(E535,'2026'!$A$16:$G$161,2,FALSE)","v":"Bilbao"},{"$f":"IF(ISBLANK(E535),\"hie eu nix drischribu\",VLOOKUP(E535,'2026'!$A$16:$G$161,3,FALSE))","v":"Bregy Alain"}]
["2026-06-15",{"$f":"IF(ISBLANK(D536),\"Alain, nix drischribu\",VLOOKUP(D536,'2026'!$A$16:$G$161,3,FALSE))","v":"Bregy Alain"},{"$f":"VLOOKUP(D536,'2026'!$A$16:$B$161,2,FALSE)","v":"Banja"},9,36,{"$f":"VLOOKUP(E536,'2026'!$A$16:$G$161,2,FALSE)","v":"Perle"},{"$f":"IF(ISBLANK(E536),\"hie eu nix drischribu\",VLOOKUP(E536,'2026'!$A$16:$G$161,3,FALSE))","v":"Lötscher Sandrine & Cédric"}]
["2026-06-15",{"$f":"IF(ISBLANK(D537),\"Alain, nix drischribu\",VLOOKUP(D537,'2026'!$A$16:$G$161,3,FALSE))","v":"Bregy Alain"},{"$f":"VLOOKUP(D537,'2026'!$A$16:$B$161,2,FALSE)","v":"Banja"},9,60,{"$f":"VLOOKUP(E537,'2026'!$A$16:$G$161,2,FALSE)","v":"Samoa"},{"$f":"IF(ISBLANK(E537),\"hie eu nix drischribu\",VLOOKUP(E537,'2026'!$A$16:$G$161,3,FALSE))","v":"Stallung Jäger & Tscherrig"}]
["2026-06-15",{"$f":"IF(ISBLANK(D538),\"Alain, nix drischribu\",VLOOKUP(D538,'2026'!$A$16:$G$161,3,FALSE))","v":"Bregy Alain"},{"$f":"VLOOKUP(D538,'2026'!$A$16:$B$161,2,FALSE)","v":"Bilbao"},7,91,{"$f":"VLOOKUP(E538,'2026'!$A$16:$G$161,2,FALSE)","v":"Vergara"},{"$f":"IF(ISBLANK(E538),\"hie eu nix drischribu\",VLOOKUP(E538,'2026'!$A$16:$G$161,3,FALSE))","v":"Zumofen / Gattlen"}]
["2026-06-15",{"$f":"IF(ISBLANK(D539),\"Alain, nix drischribu\",VLOOKUP(D539,'2026'!$A$16:$G$161,3,FALSE))","v":"Stallung Passeraub"},{"$f":"VLOOKUP(D539,'2026'!$A$16:$B$161,2,FALSE)","v":"Brunette"},74,59,{"$f":"VLOOKUP(E539,'2026'!$A$16:$G$161,2,FALSE)","v":"Medusa"},{"$f":"IF(ISBLANK(E539),\"hie eu nix drischribu\",VLOOKUP(E539,'2026'!$A$16:$G$161,3,FALSE))","v":"Stallung Jäger & Tscherrig"}]
["2026-06-15",{"$f":"IF(ISBLANK(D540),\"Alain, nix drischribu\",VLOOKUP(D540,'2026'!$A$16:$G$161,3,FALSE))","v":"Lötscher Sandrine & Cédric"},{"$f":"VLOOKUP(D540,'2026'!$A$16:$B$161,2,FALSE)","v":"Pouki"},33,73,{"$f":"VLOOKUP(E540,'2026'!$A$16:$G$161,2,FALSE)","v":"Malice"},{"$f":"IF(ISBLANK(E540),\"hie eu nix drischribu\",VLOOKUP(E540,'2026'!$A$16:$G$161,3,FALSE))","v":"Stallung Passeraub"}]
["2026-06-15",{"$f":"IF(ISBLANK(D541),\"Alain, nix drischribu\",VLOOKUP(D541,'2026'!$A$16:$G$161,3,FALSE))","v":"Zumofen / Gattlen"},{"$f":"VLOOKUP(D541,'2026'!$A$16:$B$161,2,FALSE)","v":"Vesuv"},84,33,{"$f":"VLOOKUP(E541,'2026'!$A$16:$G$161,2,FALSE)","v":"Pouki"},{"$f":"IF(ISBLANK(E541),\"hie eu nix drischribu\",VLOOKUP(E541,'2026'!$A$16:$G$161,3,FALSE))","v":"Lötscher Sandrine & Cédric"}]
["2026-06-15",{"$f":"IF(ISBLANK(D542),\"Alain, nix drischribu\",VLOOKUP(D542,'2026'!$A$16:$G$161,3,FALSE))","v":"Familie Leiggener"},{"$f":"VLOOKUP(D542,'2026'!$A$16:$B$161,2,FALSE)","v":"Tyson"},22,67,{"$f":"VLOOKUP(E542,'2026'!$A$16:$G$161,2,FALSE)","v":"Boriana"},{"$f":"IF(ISBLANK(E542),\"hie eu nix drischribu\",VLOOKUP(E542,'2026'!$A$16:$G$161,3,FALSE))","v":"Stallung Passeraub"}]
["2026-06-15",{"$f":"IF(ISBLANK(D543),\"Alain, nix drischribu\",VLOOKUP(D543,'2026'!$A$16:$G$161,3,FALSE))","v":"Hischier H. & Bühlmann J."},{"$f":"VLOOKUP(D543,'2026'!$A$16:$B$161,2,FALSE)","v":"Alena"},42,88,{"$f":"VLOOKUP(E543,'2026'!$A$16:$G$161,2,FALSE)","v":"Valdeeze"},{"$f":"IF(ISBLANK(E543),\"hie eu nix drischribu\",VLOOKUP(E543,'2026'!$A$16:$G$161,3,FALSE))","v":"Zumofen / Gattlen"}]
["2026-06-15",{"$f":"IF(ISBLANK(D544),\"Alain, nix drischribu\",VLOOKUP(D544,'2026'!$A$16:$G$161,3,FALSE))","v":"Lötscher Sandrine & Cédric"},{"$f":"VLOOKUP(D544,'2026'!$A$16:$B$161,2,FALSE)","v":"Perle"},36,10,{"$f":"VLOOKUP(E544,'2026'!$A$16:$G$161,2,FALSE)","v":"Perona"},{"$f":"IF(ISBLANK(E544),\"hie eu nix drischribu\",VLOOKUP(E544,'2026'!$A$16:$G$161,3,FALSE))","v":"Bregy Uli, Lisi & Pascal"}]
["2026-06-15",{"$f":"IF(ISBLANK(D545),\"Alain, nix drischribu\",VLOOKUP(D545,'2026'!$A$16:$G$161,3,FALSE))","v":"Stallung Passeraub"},{"$f":"VLOOKUP(D545,'2026'!$A$16:$B$161,2,FALSE)","v":"Belana"},65,50,{"$f":"VLOOKUP(E545,'2026'!$A$16:$G$161,2,FALSE)","v":"Beline"},{"$f":"IF(ISBLANK(E545),\"hie eu nix drischribu\",VLOOKUP(E545,'2026'!$A$16:$G$161,3,FALSE))","v":"Stallung Jäger & Tscherrig"}]
["2026-06-15",{"$f":"IF(ISBLANK(D546),\"Alain, nix drischribu\",VLOOKUP(D546,'2026'!$A$16:$G$161,3,FALSE))","v":"Familie Leiggener"},{"$f":"VLOOKUP(D546,'2026'!$A$16:$B$161,2,FALSE)","v":"Colette"},19,14,{"$f":"VLOOKUP(E546,'2026'!$A$16:$G$161,2,FALSE)","v":"Samba"},{"$f":"IF(ISBLANK(E546),\"hie eu nix drischribu\",VLOOKUP(E546,'2026'!$A$16:$G$161,3,FALSE))","v":"Bregy Uli, Lisi & Pascal"}]
["2026-06-15",{"$f":"IF(ISBLANK(D547),\"Alain, nix drischribu\",VLOOKUP(D547,'2026'!$A$16:$G$161,3,FALSE))","v":"Familie Leiggener"},{"$f":"VLOOKUP(D547,'2026'!$A$16:$B$161,2,FALSE)","v":"Tirana"},20,7,{"$f":"VLOOKUP(E547,'2026'!$A$16:$G$161,2,FALSE)","v":"Bilbao"},{"$f":"IF(ISBLANK(E547),\"hie eu nix drischribu\",VLOOKUP(E547,'2026'!$A$16:$G$161,3,FALSE))","v":"Bregy Alain"}]
["2026-06-15",{"$f":"IF(ISBLANK(D548),\"Alain, nix drischribu\",VLOOKUP(D548,'2026'!$A$16:$G$161,3,FALSE))","v":"Bregy Uli, Lisi & Pascal"},{"$f":"VLOOKUP(D548,'2026'!$A$16:$B$161,2,FALSE)","v":"Perona"},10,21,{"$f":"VLOOKUP(E548,'2026'!$A$16:$G$161,2,FALSE)","v":"Royale"},{"$f":"IF(ISBLANK(E548),\"hie eu nix drischribu\",VLOOKUP(E548,'2026'!$A$16:$G$161,3,FALSE))","v":"Familie Leiggener"}]
["2026-06-15",{"$f":"IF(ISBLANK(D549),\"Alain, nix drischribu\",VLOOKUP(D549,'2026'!$A$16:$G$161,3,FALSE))","v":"Zumofen / Gattlen"},{"$f":"VLOOKUP(D549,'2026'!$A$16:$B$161,2,FALSE)","v":"Roseau"},92,53,{"$f":"VLOOKUP(E549,'2026'!$A$16:$G$161,2,FALSE)","v":"Sina"},{"$f":"IF(ISBLANK(E549),\"hie eu nix drischribu\",VLOOKUP(E549,'2026'!$A$16:$G$161,3,FALSE))","v":"Stallung Jäger & Tscherrig"}]
["2026-06-15",{"$f":"IF(ISBLANK(D550),\"Alain, nix drischribu\",VLOOKUP(D550,'2026'!$A$16:$G$161,3,FALSE))","v":"Hischier H. & Bühlmann J."},{"$f":"VLOOKUP(D550,'2026'!$A$16:$B$161,2,FALSE)","v":"Baghira"},43,12,{"$f":"VLOOKUP(E550,'2026'!$A$16:$G$161,2,FALSE)","v":"Cara"},{"$f":"IF(ISBLANK(E550),\"hie eu nix drischribu\",VLOOKUP(E550,'2026'!$A$16:$G$161,3,FALSE))","v":"Bregy Uli, Lisi & Pascal"}]
["2026-06-15",{"$f":"IF(ISBLANK(D551),\"Alain, nix drischribu\",VLOOKUP(D551,'2026'!$A$16:$G$161,3,FALSE))","v":"Bregy Uli, Lisi & Pascal"},{"$f":"VLOOKUP(D551,'2026'!$A$16:$B$161,2,FALSE)","v":"Souma"},15,61,{"$f":"VLOOKUP(E551,'2026'!$A$16:$G$161,2,FALSE)","v":"Puma"},{"$f":"IF(ISBLANK(E551),\"hie eu nix drischribu\",VLOOKUP(E551,'2026'!$A$16:$G$161,3,FALSE))","v":"Stallung Jäger & Tscherrig"}]
["2026-06-15",{"$f":"IF(ISBLANK(D552),\"Alain, nix drischribu\",VLOOKUP(D552,'2026'!$A$16:$G$161,3,FALSE))","v":"Zumofen / Gattlen"},{"$f":"VLOOKUP(D552,'2026'!$A$16:$B$161,2,FALSE)","v":"Valdeeze"},88,57,{"$f":"VLOOKUP(E552,'2026'!$A$16:$G$161,2,FALSE)","v":"Bogota"},{"$f":"IF(ISBLANK(E552),\"hie eu nix drischribu\",VLOOKUP(E552,'2026'!$A$16:$G$161,3,FALSE))","v":"Stallung Jäger & Tscherrig"}]
["2026-06-15",{"$f":"IF(ISBLANK(D553),\"Alain, nix drischribu\",VLOOKUP(D553,'2026'!$A$16:$G$161,3,FALSE))","v":"Bregy Alain"},{"$f":"VLOOKUP(D553,'2026'!$A$16:$B$161,2,FALSE)","v":"Valesia"},8,59,{"$f":"VLOOKUP(E553,'2026'!$A$16:$G$161,2,FALSE)","v":"Medusa"},{"$f":"IF(ISBLANK(E553),\"hie eu nix drischribu\",VLOOKUP(E553,'2026'!$A$16:$G$161,3,FALSE))","v":"Stallung Jäger & Tscherrig"}]
["2026-06-15",{"$f":"IF(ISBLANK(D554),\"Alain, nix drischribu\",VLOOKUP(D554,'2026'!$A$16:$G$161,3,FALSE))","v":"Zumofen / Gattlen"},{"$f":"VLOOKUP(D554,'2026'!$A$16:$B$161,2,FALSE)","v":"Verygood"},89,13,{"$f":"VLOOKUP(E554,'2026'!$A$16:$G$161,2,FALSE)","v":"Cora"},{"$f":"IF(ISBLANK(E554),\"hie eu nix drischribu\",VLOOKUP(E554,'2026'!$A$16:$G$161,3,FALSE))","v":"Bregy Uli, Lisi & Pascal"}]
["2026-06-15",{"$f":"IF(ISBLANK(D555),\"Alain, nix drischribu\",VLOOKUP(D555,'2026'!$A$16:$G$161,3,FALSE))","v":"Zumofen / Gattlen"},{"$f":"VLOOKUP(D555,'2026'!$A$16:$B$161,2,FALSE)","v":"Roquette"},86,10,{"$f":"VLOOKUP(E555,'2026'!$A$16:$G$161,2,FALSE)","v":"Perona"},{"$f":"IF(ISBLANK(E555),\"hie eu nix drischribu\",VLOOKUP(E555,'2026'!$A$16:$G$161,3,FALSE))","v":"Bregy Uli, Lisi & Pascal"}]
["2026-06-15",{"$f":"IF(ISBLANK(D556),\"Alain, nix drischribu\",VLOOKUP(D556,'2026'!$A$16:$G$161,3,FALSE))","v":"Bregy Uli, Lisi & Pascal"},{"$f":"VLOOKUP(D556,'2026'!$A$16:$B$161,2,FALSE)","v":"Perona"},10,91,{"$f":"VLOOKUP(E556,'2026'!$A$16:$G$161,2,FALSE)","v":"Vergara"},{"$f":"IF(ISBLANK(E556),\"hie eu nix drischribu\",VLOOKUP(E556,'2026'!$A$16:$G$161,3,FALSE))","v":"Zumofen / Gattlen"}]
["2026-06-15",{"$f":"IF(ISBLANK(D557),\"Alain, nix drischribu\",VLOOKUP(D557,'2026'!$A$16:$G$161,3,FALSE))","v":"Bayard Medard & Gustav"},{"$f":"VLOOKUP(D557,'2026'!$A$16:$B$161,2,FALSE)","v":"Mamba"},2,91,{"$f":"VLOOKUP(E557,'2026'!$A$16:$G$161,2,FALSE)","v":"Vergara"},{"$f":"IF(ISBLANK(E557),\"hie eu nix drischribu\",VLOOKUP(E557,'2026'!$A$16:$G$161,3,FALSE))","v":"Zumofen / Gattlen"}]
["2026-06-15",{"$f":"IF(ISBLANK(D558),\"Alain, nix drischribu\",VLOOKUP(D558,'2026'!$A$16:$G$161,3,FALSE))","v":"Bayard Medard & Gustav"},{"$f":"VLOOKUP(D558,'2026'!$A$16:$B$161,2,FALSE)","v":"Mamba"},2,87,{"$f":"VLOOKUP(E558,'2026'!$A$16:$G$161,2,FALSE)","v":"Fame"},{"$f":"IF(ISBLANK(E558),\"hie eu nix drischribu\",VLOOKUP(E558,'2026'!$A$16:$G$161,3,FALSE))","v":"Zumofen / Gattlen"}]
["2026-06-15",{"$f":"IF(ISBLANK(D559),\"Alain, nix drischribu\",VLOOKUP(D559,'2026'!$A$16:$G$161,3,FALSE))","v":"Bregy Uli, Lisi & Pascal"},{"$f":"VLOOKUP(D559,'2026'!$A$16:$B$161,2,FALSE)","v":"Cora"},13,78,{"$f":"VLOOKUP(E559,'2026'!$A$16:$G$161,2,FALSE)","v":"Timba"},{"$f":"IF(ISBLANK(E559),\"hie eu nix drischribu\",VLOOKUP(E559,'2026'!$A$16:$G$161,3,FALSE))","v":"Williner Anton"}]
["2026-06-15",{"$f":"IF(ISBLANK(D560),\"Alain, nix drischribu\",VLOOKUP(D560,'2026'!$A$16:$G$161,3,FALSE))","v":"Bregy Uli, Lisi & Pascal"},{"$f":"VLOOKUP(D560,'2026'!$A$16:$B$161,2,FALSE)","v":"Perona"},10,93,{"$f":"VLOOKUP(E560,'2026'!$A$16:$G$161,2,FALSE)","v":"Farinelle"},{"$f":"IF(ISBLANK(E560),\"hie eu nix drischribu\",VLOOKUP(E560,'2026'!$A$16:$G$161,3,FALSE))","v":"Zumofen / Gattlen"}]
["2026-06-15",{"$f":"IF(ISBLANK(D561),\"Alain, nix drischribu\",VLOOKUP(D561,'2026'!$A$16:$G$161,3,FALSE))","v":"Bregy Uli, Lisi & Pascal"},{"$f":"VLOOKUP(D561,'2026'!$A$16:$B$161,2,FALSE)","v":"Cara"},12,75,{"$f":"VLOOKUP(E561,'2026'!$A$16:$G$161,2,FALSE)","v":"Baldrun"},{"$f":"IF(ISBLANK(E561),\"hie eu nix drischribu\",VLOOKUP(E561,'2026'!$A$16:$G$161,3,FALSE))","v":"Stallung Passeraub"}]
["2026-06-15",{"$f":"IF(ISBLANK(D562),\"Alain, nix drischribu\",VLOOKUP(D562,'2026'!$A$16:$G$161,3,FALSE))","v":"Hischier H. & Bühlmann J."},{"$f":"VLOOKUP(D562,'2026'!$A$16:$B$161,2,FALSE)","v":"Baghira"},43,50,{"$f":"VLOOKUP(E562,'2026'!$A$16:$G$161,2,FALSE)","v":"Beline"},{"$f":"IF(ISBLANK(E562),\"hie eu nix drischribu\",VLOOKUP(E562,'2026'!$A$16:$G$161,3,FALSE))","v":"Stallung Jäger & Tscherrig"}]
["2026-06-15",{"$f":"IF(ISBLANK(D563),\"Alain, nix drischribu\",VLOOKUP(D563,'2026'!$A$16:$G$161,3,FALSE))","v":"Stallung Jäger & Tscherrig"},{"$f":"VLOOKUP(D563,'2026'!$A$16:$B$161,2,FALSE)","v":"Bijou"},51,41,{"$f":"VLOOKUP(E563,'2026'!$A$16:$G$161,2,FALSE)","v":"Coquine"},{"$f":"IF(ISBLANK(E563),\"hie eu nix drischribu\",VLOOKUP(E563,'2026'!$A$16:$G$161,3,FALSE))","v":"Geschwister Lötscher"}]
["2026-06-15",{"$f":"IF(ISBLANK(D564),\"Alain, nix drischribu\",VLOOKUP(D564,'2026'!$A$16:$G$161,3,FALSE))","v":"Stallung Passeraub"},{"$f":"VLOOKUP(D564,'2026'!$A$16:$B$161,2,FALSE)","v":"Belle"},70,55,{"$f":"VLOOKUP(E564,'2026'!$A$16:$G$161,2,FALSE)","v":"Myla"},{"$f":"IF(ISBLANK(E564),\"hie eu nix drischribu\",VLOOKUP(E564,'2026'!$A$16:$G$161,3,FALSE))","v":"Stallung Jäger & Tscherrig"}]
["2026-06-15",{"$f":"IF(ISBLANK(D565),\"Alain, nix drischribu\",VLOOKUP(D565,'2026'!$A$16:$G$161,3,FALSE))","v":"Stallung Jäger & Tscherrig"},{"$f":"VLOOKUP(D565,'2026'!$A$16:$B$161,2,FALSE)","v":"Bijou"},51,29,{"$f":"VLOOKUP(E565,'2026'!$A$16:$G$161,2,FALSE)","v":"Tequila"},{"$f":"IF(ISBLANK(E565),\"hie eu nix drischribu\",VLOOKUP(E565,'2026'!$A$16:$G$161,3,FALSE))","v":"Gebrüder Jäger"}]
["2026-06-15",{"$f":"IF(ISBLANK(D566),\"Alain, nix drischribu\",VLOOKUP(D566,'2026'!$A$16:$G$161,3,FALSE))","v":"Stallung Passeraub"},{"$f":"VLOOKUP(D566,'2026'!$A$16:$B$161,2,FALSE)","v":"Malice"},73,59,{"$f":"VLOOKUP(E566,'2026'!$A$16:$G$161,2,FALSE)","v":"Medusa"},{"$f":"IF(ISBLANK(E566),\"hie eu nix drischribu\",VLOOKUP(E566,'2026'!$A$16:$G$161,3,FALSE))","v":"Stallung Jäger & Tscherrig"}]
["2026-06-15",{"$f":"IF(ISBLANK(D567),\"Alain, nix drischribu\",VLOOKUP(D567,'2026'!$A$16:$G$161,3,FALSE))","v":"Stallung Jäger & Tscherrig"},{"$f":"VLOOKUP(D567,'2026'!$A$16:$B$161,2,FALSE)","v":"Bogota"},57,31,{"$f":"VLOOKUP(E567,'2026'!$A$16:$G$161,2,FALSE)","v":"Santana"},{"$f":"IF(ISBLANK(E567),\"hie eu nix drischribu\",VLOOKUP(E567,'2026'!$A$16:$G$161,3,FALSE))","v":"Gebrüder Jäger"}]
["2026-06-15",{"$f":"IF(ISBLANK(D568),\"Alain, nix drischribu\",VLOOKUP(D568,'2026'!$A$16:$G$161,3,FALSE))","v":"Stallung Passeraub"},{"$f":"VLOOKUP(D568,'2026'!$A$16:$B$161,2,FALSE)","v":"Brunette"},74,30,{"$f":"VLOOKUP(E568,'2026'!$A$16:$G$161,2,FALSE)","v":"Tamango"},{"$f":"IF(ISBLANK(E568),\"hie eu nix drischribu\",VLOOKUP(E568,'2026'!$A$16:$G$161,3,FALSE))","v":"Gebrüder Jäger"}]
["2026-06-15",{"$f":"IF(ISBLANK(D569),\"Alain, nix drischribu\",VLOOKUP(D569,'2026'!$A$16:$G$161,3,FALSE))","v":"Stallung Jäger & Tscherrig"},{"$f":"VLOOKUP(D569,'2026'!$A$16:$B$161,2,FALSE)","v":"Puma"},61,47,{"$f":"VLOOKUP(E569,'2026'!$A$16:$G$161,2,FALSE)","v":"Ramona"},{"$f":"IF(ISBLANK(E569),\"hie eu nix drischribu\",VLOOKUP(E569,'2026'!$A$16:$G$161,3,FALSE))","v":"Lauber Noah & Jonas"}]
["2026-06-15",{"$f":"IF(ISBLANK(D570),\"Alain, nix drischribu\",VLOOKUP(D570,'2026'!$A$16:$G$161,3,FALSE))","v":"Stallung Jäger & Tscherrig"},{"$f":"VLOOKUP(D570,'2026'!$A$16:$B$161,2,FALSE)","v":"Pixel"},58,75,{"$f":"VLOOKUP(E570,'2026'!$A$16:$G$161,2,FALSE)","v":"Baldrun"},{"$f":"IF(ISBLANK(E570),\"hie eu nix drischribu\",VLOOKUP(E570,'2026'!$A$16:$G$161,3,FALSE))","v":"Stallung Passeraub"}]
["2026-06-15",{"$f":"IF(ISBLANK(D571),\"Alain, nix drischribu\",VLOOKUP(D571,'2026'!$A$16:$G$161,3,FALSE))","v":"Gebrüder Jäger"},{"$f":"VLOOKUP(D571,'2026'!$A$16:$B$161,2,FALSE)","v":"Luna"},28,51,{"$f":"VLOOKUP(E571,'2026'!$A$16:$G$161,2,FALSE)","v":"Bijou"},{"$f":"IF(ISBLANK(E571),\"hie eu nix drischribu\",VLOOKUP(E571,'2026'!$A$16:$G$161,3,FALSE))","v":"Stallung Jäger & Tscherrig"}]
["2026-06-15",{"$f":"IF(ISBLANK(D572),\"Alain, nix drischribu\",VLOOKUP(D572,'2026'!$A$16:$G$161,3,FALSE))","v":"Geschwister Lötscher"},{"$f":"VLOOKUP(D572,'2026'!$A$16:$B$161,2,FALSE)","v":"Casimir"},38,92,{"$f":"VLOOKUP(E572,'2026'!$A$16:$G$161,2,FALSE)","v":"Roseau"},{"$f":"IF(ISBLANK(E572),\"hie eu nix drischribu\",VLOOKUP(E572,'2026'!$A$16:$G$161,3,FALSE))","v":"Zumofen / Gattlen"}]
["2026-06-15",{"$f":"IF(ISBLANK(D573),\"Alain, nix drischribu\",VLOOKUP(D573,'2026'!$A$16:$G$161,3,FALSE))","v":"Familie Leiggener"},{"$f":"VLOOKUP(D573,'2026'!$A$16:$B$161,2,FALSE)","v":"Colette"},19,9,{"$f":"VLOOKUP(E573,'2026'!$A$16:$G$161,2,FALSE)","v":"Banja"},{"$f":"IF(ISBLANK(E573),\"hie eu nix drischribu\",VLOOKUP(E573,'2026'!$A$16:$G$161,3,FALSE))","v":"Bregy Alain"}]
["2026-06-15",{"$f":"IF(ISBLANK(D574),\"Alain, nix drischribu\",VLOOKUP(D574,'2026'!$A$16:$G$161,3,FALSE))","v":"Familie Leiggener"},{"$f":"VLOOKUP(D574,'2026'!$A$16:$B$161,2,FALSE)","v":"Colette"},19,7,{"$f":"VLOOKUP(E574,'2026'!$A$16:$G$161,2,FALSE)","v":"Bilbao"},{"$f":"IF(ISBLANK(E574),\"hie eu nix drischribu\",VLOOKUP(E574,'2026'!$A$16:$G$161,3,FALSE))","v":"Bregy Alain"}]
["2026-06-15",{"$f":"IF(ISBLANK(D575),\"Alain, nix drischribu\",VLOOKUP(D575,'2026'!$A$16:$G$161,3,FALSE))","v":"Gebrüder Jäger"},{"$f":"VLOOKUP(D575,'2026'!$A$16:$B$161,2,FALSE)","v":"Luna"},28,31,{"$f":"VLOOKUP(E575,'2026'!$A$16:$G$161,2,FALSE)","v":"Santana"},{"$f":"IF(ISBLANK(E575),\"hie eu nix drischribu\",VLOOKUP(E575,'2026'!$A$16:$G$161,3,FALSE))","v":"Gebrüder Jäger"}]
["2026-06-15",{"$f":"IF(ISBLANK(D576),\"Alain, nix drischribu\",VLOOKUP(D576,'2026'!$A$16:$G$161,3,FALSE))","v":"Stallung Jäger & Tscherrig"},{"$f":"VLOOKUP(D576,'2026'!$A$16:$B$161,2,FALSE)","v":"Bijou"},51,74,{"$f":"VLOOKUP(E576,'2026'!$A$16:$G$161,2,FALSE)","v":"Brunette"},{"$f":"IF(ISBLANK(E576),\"hie eu nix drischribu\",VLOOKUP(E576,'2026'!$A$16:$G$161,3,FALSE))","v":"Stallung Passeraub"}]
["2026-06-15",{"$f":"IF(ISBLANK(D577),\"Alain, nix drischribu\",VLOOKUP(D577,'2026'!$A$16:$G$161,3,FALSE))","v":"Stallung Jäger & Tscherrig"},{"$f":"VLOOKUP(D577,'2026'!$A$16:$B$161,2,FALSE)","v":"Sina"},53,73,{"$f":"VLOOKUP(E577,'2026'!$A$16:$G$161,2,FALSE)","v":"Malice"},{"$f":"IF(ISBLANK(E577),\"hie eu nix drischribu\",VLOOKUP(E577,'2026'!$A$16:$G$161,3,FALSE))","v":"Stallung Passeraub"}]
["2026-06-15",{"$f":"IF(ISBLANK(D578),\"Alain, nix drischribu\",VLOOKUP(D578,'2026'!$A$16:$G$161,3,FALSE))","v":"Stallung Jäger & Tscherrig"},{"$f":"VLOOKUP(D578,'2026'!$A$16:$B$161,2,FALSE)","v":"Sina"},53,74,{"$f":"VLOOKUP(E578,'2026'!$A$16:$G$161,2,FALSE)","v":"Brunette"},{"$f":"IF(ISBLANK(E578),\"hie eu nix drischribu\",VLOOKUP(E578,'2026'!$A$16:$G$161,3,FALSE))","v":"Stallung Passeraub"}]
["2026-06-15",{"$f":"IF(ISBLANK(D579),\"Alain, nix drischribu\",VLOOKUP(D579,'2026'!$A$16:$G$161,3,FALSE))","v":"Hischier H. & Bühlmann J."},{"$f":"VLOOKUP(D579,'2026'!$A$16:$B$161,2,FALSE)","v":"Baghira"},43,15,{"$f":"VLOOKUP(E579,'2026'!$A$16:$G$161,2,FALSE)","v":"Souma"},{"$f":"IF(ISBLANK(E579),\"hie eu nix drischribu\",VLOOKUP(E579,'2026'!$A$16:$G$161,3,FALSE))","v":"Bregy Uli, Lisi & Pascal"}]
["2026-06-15",{"$f":"IF(ISBLANK(D580),\"Alain, nix drischribu\",VLOOKUP(D580,'2026'!$A$16:$G$161,3,FALSE))","v":"Stallung Mussmann"},{"$f":"VLOOKUP(D580,'2026'!$A$16:$B$161,2,FALSE)","v":"Mistral"},63,70,{"$f":"VLOOKUP(E580,'2026'!$A$16:$G$161,2,FALSE)","v":"Belle"},{"$f":"IF(ISBLANK(E580),\"hie eu nix drischribu\",VLOOKUP(E580,'2026'!$A$16:$G$161,3,FALSE))","v":"Stallung Passeraub"}]
["2026-06-15",{"$f":"IF(ISBLANK(D581),\"Alain, nix drischribu\",VLOOKUP(D581,'2026'!$A$16:$G$161,3,FALSE))","v":"Stallung Jäger & Tscherrig"},{"$f":"VLOOKUP(D581,'2026'!$A$16:$B$161,2,FALSE)","v":"Beline"},50,22,{"$f":"VLOOKUP(E581,'2026'!$A$16:$G$161,2,FALSE)","v":"Tyson"},{"$f":"IF(ISBLANK(E581),\"hie eu nix drischribu\",VLOOKUP(E581,'2026'!$A$16:$G$161,3,FALSE))","v":"Familie Leiggener"}]
["2026-06-15",{"$f":"IF(ISBLANK(D582),\"Alain, nix drischribu\",VLOOKUP(D582,'2026'!$A$16:$G$161,3,FALSE))","v":"Familie Leiggener"},{"$f":"VLOOKUP(D582,'2026'!$A$16:$B$161,2,FALSE)","v":"Royale"},21,76,{"$f":"VLOOKUP(E582,'2026'!$A$16:$G$161,2,FALSE)","v":"Venus"},{"$f":"IF(ISBLANK(E582),\"hie eu nix drischribu\",VLOOKUP(E582,'2026'!$A$16:$G$161,3,FALSE))","v":"Williner Anton"}]
["2026-06-15",{"$f":"IF(ISBLANK(D583),\"Alain, nix drischribu\",VLOOKUP(D583,'2026'!$A$16:$G$161,3,FALSE))","v":"Zumofen / Gattlen"},{"$f":"VLOOKUP(D583,'2026'!$A$16:$B$161,2,FALSE)","v":"Farinelle"},93,19,{"$f":"VLOOKUP(E583,'2026'!$A$16:$G$161,2,FALSE)","v":"Colette"},{"$f":"IF(ISBLANK(E583),\"hie eu nix drischribu\",VLOOKUP(E583,'2026'!$A$16:$G$161,3,FALSE))","v":"Familie Leiggener"}]
["2026-06-14",{"$f":"IF(ISBLANK(D584),\"Alain, nix drischribu\",VLOOKUP(D584,'2026'!$A$16:$G$161,3,FALSE))","v":"Stallung Mussmann"},{"$f":"VLOOKUP(D584,'2026'!$A$16:$B$161,2,FALSE)","v":"Xenia"},62,56,{"$f":"VLOOKUP(E584,'2026'!$A$16:$G$161,2,FALSE)","v":"Fanny"},{"$f":"IF(ISBLANK(E584),\"hie eu nix drischribu\",VLOOKUP(E584,'2026'!$A$16:$G$161,3,FALSE))","v":"Stallung Jäger & Tscherrig"}]
["2026-06-14",{"$f":"IF(ISBLANK(D585),\"Alain, nix drischribu\",VLOOKUP(D585,'2026'!$A$16:$G$161,3,FALSE))","v":"Gebrüder Jäger"},{"$f":"VLOOKUP(D585,'2026'!$A$16:$B$161,2,FALSE)","v":"Luna"},28,56,{"$f":"VLOOKUP(E585,'2026'!$A$16:$G$161,2,FALSE)","v":"Fanny"},{"$f":"IF(ISBLANK(E585),\"hie eu nix drischribu\",VLOOKUP(E585,'2026'!$A$16:$G$161,3,FALSE))","v":"Stallung Jäger & Tscherrig"}]
["2026-06-14",{"$f":"IF(ISBLANK(D586),\"Alain, nix drischribu\",VLOOKUP(D586,'2026'!$A$16:$G$161,3,FALSE))","v":"Familie Leiggener"},{"$f":"VLOOKUP(D586,'2026'!$A$16:$B$161,2,FALSE)","v":"Royale"},21,50,{"$f":"VLOOKUP(E586,'2026'!$A$16:$G$161,2,FALSE)","v":"Beline"},{"$f":"IF(ISBLANK(E586),\"hie eu nix drischribu\",VLOOKUP(E586,'2026'!$A$16:$G$161,3,FALSE))","v":"Stallung Jäger & Tscherrig"}]
["2026-06-14",{"$f":"IF(ISBLANK(D587),\"Alain, nix drischribu\",VLOOKUP(D587,'2026'!$A$16:$G$161,3,FALSE))","v":"Bregy Alain"},{"$f":"VLOOKUP(D587,'2026'!$A$16:$B$161,2,FALSE)","v":"Banja"},9,27,{"$f":"VLOOKUP(E587,'2026'!$A$16:$G$161,2,FALSE)","v":"Silene"},{"$f":"IF(ISBLANK(E587),\"hie eu nix drischribu\",VLOOKUP(E587,'2026'!$A$16:$G$161,3,FALSE))","v":"Gebrüder Jäger"}]
["2026-06-14",{"$f":"IF(ISBLANK(D588),\"Alain, nix drischribu\",VLOOKUP(D588,'2026'!$A$16:$G$161,3,FALSE))","v":"Bregy Uli, Lisi & Pascal"},{"$f":"VLOOKUP(D588,'2026'!$A$16:$B$161,2,FALSE)","v":"Cara"},12,25,{"$f":"VLOOKUP(E588,'2026'!$A$16:$G$161,2,FALSE)","v":"Tirana"},{"$f":"IF(ISBLANK(E588),\"hie eu nix drischribu\",VLOOKUP(E588,'2026'!$A$16:$G$161,3,FALSE))","v":"Gebrüder Jäger"}]
["2026-06-14",{"$f":"IF(ISBLANK(D589),\"Alain, nix drischribu\",VLOOKUP(D589,'2026'!$A$16:$G$161,3,FALSE))","v":"Stallung Jäger & Tscherrig"},{"$f":"VLOOKUP(D589,'2026'!$A$16:$B$161,2,FALSE)","v":"Pinga"},54,77,{"$f":"VLOOKUP(E589,'2026'!$A$16:$G$161,2,FALSE)","v":"Tirana"},{"$f":"IF(ISBLANK(E589),\"hie eu nix drischribu\",VLOOKUP(E589,'2026'!$A$16:$G$161,3,FALSE))","v":"Williner Anton"}]
["2026-06-14",{"$f":"IF(ISBLANK(D590),\"Alain, nix drischribu\",VLOOKUP(D590,'2026'!$A$16:$G$161,3,FALSE))","v":"Bregy Alain"},{"$f":"VLOOKUP(D590,'2026'!$A$16:$B$161,2,FALSE)","v":"Bilbao"},7,2,{"$f":"VLOOKUP(E590,'2026'!$A$16:$G$161,2,FALSE)","v":"Mamba"},{"$f":"IF(ISBLANK(E590),\"hie eu nix drischribu\",VLOOKUP(E590,'2026'!$A$16:$G$161,3,FALSE))","v":"Bayard Medard & Gustav"}]
["2026-06-14",{"$f":"IF(ISBLANK(D591),\"Alain, nix drischribu\",VLOOKUP(D591,'2026'!$A$16:$G$161,3,FALSE))","v":"Gebrüder Jäger"},{"$f":"VLOOKUP(D591,'2026'!$A$16:$B$161,2,FALSE)","v":"Tamara"},24,91,{"$f":"VLOOKUP(E591,'2026'!$A$16:$G$161,2,FALSE)","v":"Vergara"},{"$f":"IF(ISBLANK(E591),\"hie eu nix drischribu\",VLOOKUP(E591,'2026'!$A$16:$G$161,3,FALSE))","v":"Zumofen / Gattlen"}]
["2026-06-14",{"$f":"IF(ISBLANK(D592),\"Alain, nix drischribu\",VLOOKUP(D592,'2026'!$A$16:$G$161,3,FALSE))","v":"Bregy Uli, Lisi & Pascal"},{"$f":"VLOOKUP(D592,'2026'!$A$16:$B$161,2,FALSE)","v":"Cora"},13,91,{"$f":"VLOOKUP(E592,'2026'!$A$16:$G$161,2,FALSE)","v":"Vergara"},{"$f":"IF(ISBLANK(E592),\"hie eu nix drischribu\",VLOOKUP(E592,'2026'!$A$16:$G$161,3,FALSE))","v":"Zumofen / Gattlen"}]
["2026-06-14",{"$f":"IF(ISBLANK(D593),\"Alain, nix drischribu\",VLOOKUP(D593,'2026'!$A$16:$G$161,3,FALSE))","v":"Stallung Jäger & Tscherrig"},{"$f":"VLOOKUP(D593,'2026'!$A$16:$B$161,2,FALSE)","v":"Fanny"},56,9,{"$f":"VLOOKUP(E593,'2026'!$A$16:$G$161,2,FALSE)","v":"Banja"},{"$f":"IF(ISBLANK(E593),\"hie eu nix drischribu\",VLOOKUP(E593,'2026'!$A$16:$G$161,3,FALSE))","v":"Bregy Alain"}]
["2026-06-14",{"$f":"IF(ISBLANK(D594),\"Alain, nix drischribu\",VLOOKUP(D594,'2026'!$A$16:$G$161,3,FALSE))","v":"Stallung Passeraub"},{"$f":"VLOOKUP(D594,'2026'!$A$16:$B$161,2,FALSE)","v":"Bonita"},64,27,{"$f":"VLOOKUP(E594,'2026'!$A$16:$G$161,2,FALSE)","v":"Silene"},{"$f":"IF(ISBLANK(E594),\"hie eu nix drischribu\",VLOOKUP(E594,'2026'!$A$16:$G$161,3,FALSE))","v":"Gebrüder Jäger"}]
["2026-06-14",{"$f":"IF(ISBLANK(D595),\"Alain, nix drischribu\",VLOOKUP(D595,'2026'!$A$16:$G$161,3,FALSE))","v":"Familie Leiggener"},{"$f":"VLOOKUP(D595,'2026'!$A$16:$B$161,2,FALSE)","v":"Tyson"},22,27,{"$f":"VLOOKUP(E595,'2026'!$A$16:$G$161,2,FALSE)","v":"Silene"},{"$f":"IF(ISBLANK(E595),\"hie eu nix drischribu\",VLOOKUP(E595,'2026'!$A$16:$G$161,3,FALSE))","v":"Gebrüder Jäger"}]
["2026-06-14",{"$f":"IF(ISBLANK(D596),\"Alain, nix drischribu\",VLOOKUP(D596,'2026'!$A$16:$G$161,3,FALSE))","v":"Gebrüder Jäger"},{"$f":"VLOOKUP(D596,'2026'!$A$16:$B$161,2,FALSE)","v":"Soraya"},23,46,{"$f":"VLOOKUP(E596,'2026'!$A$16:$G$161,2,FALSE)","v":"Cherico"},{"$f":"IF(ISBLANK(E596),\"hie eu nix drischribu\",VLOOKUP(E596,'2026'!$A$16:$G$161,3,FALSE))","v":"Lauber Noah & Jonas"}]
["2026-06-14",{"$f":"IF(ISBLANK(D597),\"Alain, nix drischribu\",VLOOKUP(D597,'2026'!$A$16:$G$161,3,FALSE))","v":"Stallung Jäger & Tscherrig"},{"$f":"VLOOKUP(D597,'2026'!$A$16:$B$161,2,FALSE)","v":"Fanny"},56,61,{"$f":"VLOOKUP(E597,'2026'!$A$16:$G$161,2,FALSE)","v":"Puma"},{"$f":"IF(ISBLANK(E597),\"hie eu nix drischribu\",VLOOKUP(E597,'2026'!$A$16:$G$161,3,FALSE))","v":"Stallung Jäger & Tscherrig"}]
["2026-06-14",{"$f":"IF(ISBLANK(D598),\"Alain, nix drischribu\",VLOOKUP(D598,'2026'!$A$16:$G$161,3,FALSE))","v":"Familie Leiggener"},{"$f":"VLOOKUP(D598,'2026'!$A$16:$B$161,2,FALSE)","v":"Royale"},21,54,{"$f":"VLOOKUP(E598,'2026'!$A$16:$G$161,2,FALSE)","v":"Pinga"},{"$f":"IF(ISBLANK(E598),\"hie eu nix drischribu\",VLOOKUP(E598,'2026'!$A$16:$G$161,3,FALSE))","v":"Stallung Jäger & Tscherrig"}]
["2026-06-14",{"$f":"IF(ISBLANK(D599),\"Alain, nix drischribu\",VLOOKUP(D599,'2026'!$A$16:$G$161,3,FALSE))","v":"Stallung Mussmann"},{"$f":"VLOOKUP(D599,'2026'!$A$16:$B$161,2,FALSE)","v":"Mistral"},63,35,{"$f":"VLOOKUP(E599,'2026'!$A$16:$G$161,2,FALSE)","v":"Cartouche"},{"$f":"IF(ISBLANK(E599),\"hie eu nix drischribu\",VLOOKUP(E599,'2026'!$A$16:$G$161,3,FALSE))","v":"Geschwister Lötscher"}]
["2026-06-14",{"$f":"IF(ISBLANK(D600),\"Alain, nix drischribu\",VLOOKUP(D600,'2026'!$A$16:$G$161,3,FALSE))","v":"Bregy Uli, Lisi & Pascal"},{"$f":"VLOOKUP(D600,'2026'!$A$16:$B$161,2,FALSE)","v":"Perona"},10,39,{"$f":"VLOOKUP(E600,'2026'!$A$16:$G$161,2,FALSE)","v":"Chips"},{"$f":"IF(ISBLANK(E600),\"hie eu nix drischribu\",VLOOKUP(E600,'2026'!$A$16:$G$161,3,FALSE))","v":"Geschwister Lötscher"}]
["2026-06-14",{"$f":"IF(ISBLANK(D601),\"Alain, nix drischribu\",VLOOKUP(D601,'2026'!$A$16:$G$161,3,FALSE))","v":"Williner Anton"},{"$f":"VLOOKUP(D601,'2026'!$A$16:$B$161,2,FALSE)","v":"Tirana"},77,60,{"$f":"VLOOKUP(E601,'2026'!$A$16:$G$161,2,FALSE)","v":"Samoa"},{"$f":"IF(ISBLANK(E601),\"hie eu nix drischribu\",VLOOKUP(E601,'2026'!$A$16:$G$161,3,FALSE))","v":"Stallung Jäger & Tscherrig"}]
["2026-06-14",{"$f":"IF(ISBLANK(D602),\"Alain, nix drischribu\",VLOOKUP(D602,'2026'!$A$16:$G$161,3,FALSE))","v":"Stallung Jäger & Tscherrig"},{"$f":"VLOOKUP(D602,'2026'!$A$16:$B$161,2,FALSE)","v":"Pinga"},54,77,{"$f":"VLOOKUP(E602,'2026'!$A$16:$G$161,2,FALSE)","v":"Tirana"},{"$f":"IF(ISBLANK(E602),\"hie eu nix drischribu\",VLOOKUP(E602,'2026'!$A$16:$G$161,3,FALSE))","v":"Williner Anton"}]
["2026-06-14",{"$f":"IF(ISBLANK(D603),\"Alain, nix drischribu\",VLOOKUP(D603,'2026'!$A$16:$G$161,3,FALSE))","v":"Zumofen / Gattlen"},{"$f":"VLOOKUP(D603,'2026'!$A$16:$B$161,2,FALSE)","v":"Vergara"},91,54,{"$f":"VLOOKUP(E603,'2026'!$A$16:$G$161,2,FALSE)","v":"Pinga"},{"$f":"IF(ISBLANK(E603),\"hie eu nix drischribu\",VLOOKUP(E603,'2026'!$A$16:$G$161,3,FALSE))","v":"Stallung Jäger & Tscherrig"}]
["2026-06-14",{"$f":"IF(ISBLANK(D604),\"Alain, nix drischribu\",VLOOKUP(D604,'2026'!$A$16:$G$161,3,FALSE))","v":"Stallung Jäger & Tscherrig"},{"$f":"VLOOKUP(D604,'2026'!$A$16:$B$161,2,FALSE)","v":"Pixel"},58,31,{"$f":"VLOOKUP(E604,'2026'!$A$16:$G$161,2,FALSE)","v":"Santana"},{"$f":"IF(ISBLANK(E604),\"hie eu nix drischribu\",VLOOKUP(E604,'2026'!$A$16:$G$161,3,FALSE))","v":"Gebrüder Jäger"}]
["2026-06-14",{"$f":"IF(ISBLANK(D605),\"Alain, nix drischribu\",VLOOKUP(D605,'2026'!$A$16:$G$161,3,FALSE))","v":"Stallung Jäger & Tscherrig"},{"$f":"VLOOKUP(D605,'2026'!$A$16:$B$161,2,FALSE)","v":"Pixel"},58,30,{"$f":"VLOOKUP(E605,'2026'!$A$16:$G$161,2,FALSE)","v":"Tamango"},{"$f":"IF(ISBLANK(E605),\"hie eu nix drischribu\",VLOOKUP(E605,'2026'!$A$16:$G$161,3,FALSE))","v":"Gebrüder Jäger"}]
["2026-06-14",{"$f":"IF(ISBLANK(D606),\"Alain, nix drischribu\",VLOOKUP(D606,'2026'!$A$16:$G$161,3,FALSE))","v":"Stallung Jäger & Tscherrig"},{"$f":"VLOOKUP(D606,'2026'!$A$16:$B$161,2,FALSE)","v":"Puma"},61,23,{"$f":"VLOOKUP(E606,'2026'!$A$16:$G$161,2,FALSE)","v":"Soraya"},{"$f":"IF(ISBLANK(E606),\"hie eu nix drischribu\",VLOOKUP(E606,'2026'!$A$16:$G$161,3,FALSE))","v":"Gebrüder Jäger"}]
["2026-06-14",{"$f":"IF(ISBLANK(D607),\"Alain, nix drischribu\",VLOOKUP(D607,'2026'!$A$16:$G$161,3,FALSE))","v":"Lauber Noah & Jonas"},{"$f":"VLOOKUP(D607,'2026'!$A$16:$B$161,2,FALSE)","v":"Ramona"},47,78,{"$f":"VLOOKUP(E607,'2026'!$A$16:$G$161,2,FALSE)","v":"Timba"},{"$f":"IF(ISBLANK(E607),\"hie eu nix drischribu\",VLOOKUP(E607,'2026'!$A$16:$G$161,3,FALSE))","v":"Williner Anton"}]
["2026-06-14",{"$f":"IF(ISBLANK(D608),\"Alain, nix drischribu\",VLOOKUP(D608,'2026'!$A$16:$G$161,3,FALSE))","v":"Stallung Passeraub"},{"$f":"VLOOKUP(D608,'2026'!$A$16:$B$161,2,FALSE)","v":"Bonita"},64,91,{"$f":"VLOOKUP(E608,'2026'!$A$16:$G$161,2,FALSE)","v":"Vergara"},{"$f":"IF(ISBLANK(E608),\"hie eu nix drischribu\",VLOOKUP(E608,'2026'!$A$16:$G$161,3,FALSE))","v":"Zumofen / Gattlen"}]
["2026-06-14",{"$f":"IF(ISBLANK(D609),\"Alain, nix drischribu\",VLOOKUP(D609,'2026'!$A$16:$G$161,3,FALSE))","v":"Williner Anton"},{"$f":"VLOOKUP(D609,'2026'!$A$16:$B$161,2,FALSE)","v":"Tirana"},77,75,{"$f":"VLOOKUP(E609,'2026'!$A$16:$G$161,2,FALSE)","v":"Baldrun"},{"$f":"IF(ISBLANK(E609),\"hie eu nix drischribu\",VLOOKUP(E609,'2026'!$A$16:$G$161,3,FALSE))","v":"Stallung Passeraub"}]
["2026-06-14",{"$f":"IF(ISBLANK(D610),\"Alain, nix drischribu\",VLOOKUP(D610,'2026'!$A$16:$G$161,3,FALSE))","v":"Stallung Jäger & Tscherrig"},{"$f":"VLOOKUP(D610,'2026'!$A$16:$B$161,2,FALSE)","v":"Samba"},49,91,{"$f":"VLOOKUP(E610,'2026'!$A$16:$G$161,2,FALSE)","v":"Vergara"},{"$f":"IF(ISBLANK(E610),\"hie eu nix drischribu\",VLOOKUP(E610,'2026'!$A$16:$G$161,3,FALSE))","v":"Zumofen / Gattlen"}]
["2026-06-14",{"$f":"IF(ISBLANK(D611),\"Alain, nix drischribu\",VLOOKUP(D611,'2026'!$A$16:$G$161,3,FALSE))","v":"Geschwister Lötscher"},{"$f":"VLOOKUP(D611,'2026'!$A$16:$B$161,2,FALSE)","v":"Cobra"},37,16,{"$f":"VLOOKUP(E611,'2026'!$A$16:$G$161,2,FALSE)","v":"Belle"},{"$f":"IF(ISBLANK(E611),\"hie eu nix drischribu\",VLOOKUP(E611,'2026'!$A$16:$G$161,3,FALSE))","v":"Bregy Uli, Lisi & Pascal"}]
["2026-06-14",{"$f":"IF(ISBLANK(D612),\"Alain, nix drischribu\",VLOOKUP(D612,'2026'!$A$16:$G$161,3,FALSE))","v":"Lötscher Sandrine & Cédric"},{"$f":"VLOOKUP(D612,'2026'!$A$16:$B$161,2,FALSE)","v":"Pouki"},33,3,{"$f":"VLOOKUP(E612,'2026'!$A$16:$G$161,2,FALSE)","v":"Pegasus"},{"$f":"IF(ISBLANK(E612),\"hie eu nix drischribu\",VLOOKUP(E612,'2026'!$A$16:$G$161,3,FALSE))","v":"Bayard Medard & Gustav"}]
["2026-06-14",{"$f":"IF(ISBLANK(D613),\"Alain, nix drischribu\",VLOOKUP(D613,'2026'!$A$16:$G$161,3,FALSE))","v":"Lötscher Sandrine & Cédric"},{"$f":"VLOOKUP(D613,'2026'!$A$16:$B$161,2,FALSE)","v":"Pouki"},33,2,{"$f":"VLOOKUP(E613,'2026'!$A$16:$G$161,2,FALSE)","v":"Mamba"},{"$f":"IF(ISBLANK(E613),\"hie eu nix drischribu\",VLOOKUP(E613,'2026'!$A$16:$G$161,3,FALSE))","v":"Bayard Medard & Gustav"}]
["2026-06-14",{"$f":"IF(ISBLANK(D614),\"Alain, nix drischribu\",VLOOKUP(D614,'2026'!$A$16:$G$161,3,FALSE))","v":"Bayard Medard & Gustav"},{"$f":"VLOOKUP(D614,'2026'!$A$16:$B$161,2,FALSE)","v":"Vampir"},4,8,{"$f":"VLOOKUP(E614,'2026'!$A$16:$G$161,2,FALSE)","v":"Valesia"},{"$f":"IF(ISBLANK(E614),\"hie eu nix drischribu\",VLOOKUP(E614,'2026'!$A$16:$G$161,3,FALSE))","v":"Bregy Alain"}]
["2026-06-14",{"$f":"IF(ISBLANK(D615),\"Alain, nix drischribu\",VLOOKUP(D615,'2026'!$A$16:$G$161,3,FALSE))","v":"Lötscher Sandrine & Cédric"},{"$f":"VLOOKUP(D615,'2026'!$A$16:$B$161,2,FALSE)","v":"Pouki"},33,77,{"$f":"VLOOKUP(E615,'2026'!$A$16:$G$161,2,FALSE)","v":"Tirana"},{"$f":"IF(ISBLANK(E615),\"hie eu nix drischribu\",VLOOKUP(E615,'2026'!$A$16:$G$161,3,FALSE))","v":"Williner Anton"}]
["2026-06-14",{"$f":"IF(ISBLANK(D616),\"Alain, nix drischribu\",VLOOKUP(D616,'2026'!$A$16:$G$161,3,FALSE))","v":"Stallung Jäger & Tscherrig"},{"$f":"VLOOKUP(D616,'2026'!$A$16:$B$161,2,FALSE)","v":"Santana"},52,91,{"$f":"VLOOKUP(E616,'2026'!$A$16:$G$161,2,FALSE)","v":"Vergara"},{"$f":"IF(ISBLANK(E616),\"hie eu nix drischribu\",VLOOKUP(E616,'2026'!$A$16:$G$161,3,FALSE))","v":"Zumofen / Gattlen"}]
["2026-06-14",{"$f":"IF(ISBLANK(D617),\"Alain, nix drischribu\",VLOOKUP(D617,'2026'!$A$16:$G$161,3,FALSE))","v":"Zumofen / Gattlen"},{"$f":"VLOOKUP(D617,'2026'!$A$16:$B$161,2,FALSE)","v":"Roquette"},86,64,{"$f":"VLOOKUP(E617,'2026'!$A$16:$G$161,2,FALSE)","v":"Bonita"},{"$f":"IF(ISBLANK(E617),\"hie eu nix drischribu\",VLOOKUP(E617,'2026'!$A$16:$G$161,3,FALSE))","v":"Stallung Passeraub"}]
["2026-06-14",{"$f":"IF(ISBLANK(D618),\"Alain, nix drischribu\",VLOOKUP(D618,'2026'!$A$16:$G$161,3,FALSE))","v":"Bregy Uli, Lisi & Pascal"},{"$f":"VLOOKUP(D618,'2026'!$A$16:$B$161,2,FALSE)","v":"Perona"},10,87,{"$f":"VLOOKUP(E618,'2026'!$A$16:$G$161,2,FALSE)","v":"Fame"},{"$f":"IF(ISBLANK(E618),\"hie eu nix drischribu\",VLOOKUP(E618,'2026'!$A$16:$G$161,3,FALSE))","v":"Zumofen / Gattlen"}]
["2026-06-14",{"$f":"IF(ISBLANK(D619),\"Alain, nix drischribu\",VLOOKUP(D619,'2026'!$A$16:$G$161,3,FALSE))","v":"Zumofen / Gattlen"},{"$f":"VLOOKUP(D619,'2026'!$A$16:$B$161,2,FALSE)","v":"Roquette"},86,63,{"$f":"VLOOKUP(E619,'2026'!$A$16:$G$161,2,FALSE)","v":"Mistral"},{"$f":"IF(ISBLANK(E619),\"hie eu nix drischribu\",VLOOKUP(E619,'2026'!$A$16:$G$161,3,FALSE))","v":"Stallung Mussmann"}]
["2026-06-14",{"$f":"IF(ISBLANK(D620),\"Alain, nix drischribu\",VLOOKUP(D620,'2026'!$A$16:$G$161,3,FALSE))","v":"Lötscher Sandrine & Cédric"},{"$f":"VLOOKUP(D620,'2026'!$A$16:$B$161,2,FALSE)","v":"Pouki"},33,43,{"$f":"VLOOKUP(E620,'2026'!$A$16:$G$161,2,FALSE)","v":"Baghira"},{"$f":"IF(ISBLANK(E620),\"hie eu nix drischribu\",VLOOKUP(E620,'2026'!$A$16:$G$161,3,FALSE))","v":"Hischier H. & Bühlmann J."}]
["2026-06-14",{"$f":"IF(ISBLANK(D621),\"Alain, nix drischribu\",VLOOKUP(D621,'2026'!$A$16:$G$161,3,FALSE))","v":"Lauber Noah & Jonas"},{"$f":"VLOOKUP(D621,'2026'!$A$16:$B$161,2,FALSE)","v":"Cherico"},46,16,{"$f":"VLOOKUP(E621,'2026'!$A$16:$G$161,2,FALSE)","v":"Belle"},{"$f":"IF(ISBLANK(E621),\"hie eu nix drischribu\",VLOOKUP(E621,'2026'!$A$16:$G$161,3,FALSE))","v":"Bregy Uli, Lisi & Pascal"}]
["2026-06-14",{"$f":"IF(ISBLANK(D622),\"Alain, nix drischribu\",VLOOKUP(D622,'2026'!$A$16:$G$161,3,FALSE))","v":"Bregy Uli, Lisi & Pascal"},{"$f":"VLOOKUP(D622,'2026'!$A$16:$B$161,2,FALSE)","v":"Samba"},14,20,{"$f":"VLOOKUP(E622,'2026'!$A$16:$G$161,2,FALSE)","v":"Tirana"},{"$f":"IF(ISBLANK(E622),\"hie eu nix drischribu\",VLOOKUP(E622,'2026'!$A$16:$G$161,3,FALSE))","v":"Familie Leiggener"}]
["2026-06-14",{"$f":"IF(ISBLANK(D623),\"Alain, nix drischribu\",VLOOKUP(D623,'2026'!$A$16:$G$161,3,FALSE))","v":"Lauber Noah & Jonas"},{"$f":"VLOOKUP(D623,'2026'!$A$16:$B$161,2,FALSE)","v":"Ramona"},47,75,{"$f":"VLOOKUP(E623,'2026'!$A$16:$G$161,2,FALSE)","v":"Baldrun"},{"$f":"IF(ISBLANK(E623),\"hie eu nix drischribu\",VLOOKUP(E623,'2026'!$A$16:$G$161,3,FALSE))","v":"Stallung Passeraub"}]
["2026-06-14",{"$f":"IF(ISBLANK(D624),\"Alain, nix drischribu\",VLOOKUP(D624,'2026'!$A$16:$G$161,3,FALSE))","v":"Stallung Passeraub"},{"$f":"VLOOKUP(D624,'2026'!$A$16:$B$161,2,FALSE)","v":"Bonita"},64,47,{"$f":"VLOOKUP(E624,'2026'!$A$16:$G$161,2,FALSE)","v":"Ramona"},{"$f":"IF(ISBLANK(E624),\"hie eu nix drischribu\",VLOOKUP(E624,'2026'!$A$16:$G$161,3,FALSE))","v":"Lauber Noah & Jonas"}]
["2026-06-14",{"$f":"IF(ISBLANK(D625),\"Alain, nix drischribu\",VLOOKUP(D625,'2026'!$A$16:$G$161,3,FALSE))","v":"Familie Leiggener"},{"$f":"VLOOKUP(D625,'2026'!$A$16:$B$161,2,FALSE)","v":"Tyson"},22,18,{"$f":"VLOOKUP(E625,'2026'!$A$16:$G$161,2,FALSE)","v":"Calina"},{"$f":"IF(ISBLANK(E625),\"hie eu nix drischribu\",VLOOKUP(E625,'2026'!$A$16:$G$161,3,FALSE))","v":"Bregy Uli, Lisi & Pascal"}]
["2026-06-14",{"$f":"IF(ISBLANK(D626),\"Alain, nix drischribu\",VLOOKUP(D626,'2026'!$A$16:$G$161,3,FALSE))","v":"Gebrüder Jäger"},{"$f":"VLOOKUP(D626,'2026'!$A$16:$B$161,2,FALSE)","v":"Soraya"},23,72,{"$f":"VLOOKUP(E626,'2026'!$A$16:$G$161,2,FALSE)","v":"Poseidon"},{"$f":"IF(ISBLANK(E626),\"hie eu nix drischribu\",VLOOKUP(E626,'2026'!$A$16:$G$161,3,FALSE))","v":"Hutter Richard"}]
["2026-06-14",{"$f":"IF(ISBLANK(D627),\"Alain, nix drischribu\",VLOOKUP(D627,'2026'!$A$16:$G$161,3,FALSE))","v":"Bregy Uli, Lisi & Pascal"},{"$f":"VLOOKUP(D627,'2026'!$A$16:$B$161,2,FALSE)","v":"Cora"},13,75,{"$f":"VLOOKUP(E627,'2026'!$A$16:$G$161,2,FALSE)","v":"Baldrun"},{"$f":"IF(ISBLANK(E627),\"hie eu nix drischribu\",VLOOKUP(E627,'2026'!$A$16:$G$161,3,FALSE))","v":"Stallung Passeraub"}]
["2026-06-14",{"$f":"IF(ISBLANK(D628),\"Alain, nix drischribu\",VLOOKUP(D628,'2026'!$A$16:$G$161,3,FALSE))","v":"Zumofen / Gattlen"},{"$f":"VLOOKUP(D628,'2026'!$A$16:$B$161,2,FALSE)","v":"Vergara"},91,8,{"$f":"VLOOKUP(E628,'2026'!$A$16:$G$161,2,FALSE)","v":"Valesia"},{"$f":"IF(ISBLANK(E628),\"hie eu nix drischribu\",VLOOKUP(E628,'2026'!$A$16:$G$161,3,FALSE))","v":"Bregy Alain"}]
["2026-06-14",{"$f":"IF(ISBLANK(D629),\"Alain, nix drischribu\",VLOOKUP(D629,'2026'!$A$16:$G$161,3,FALSE))","v":"Hischier H. & Bühlmann J."},{"$f":"VLOOKUP(D629,'2026'!$A$16:$B$161,2,FALSE)","v":"Tara"},44,47,{"$f":"VLOOKUP(E629,'2026'!$A$16:$G$161,2,FALSE)","v":"Ramona"},{"$f":"IF(ISBLANK(E629),\"hie eu nix drischribu\",VLOOKUP(E629,'2026'!$A$16:$G$161,3,FALSE))","v":"Lauber Noah & Jonas"}]
["2026-06-14",{"$f":"IF(ISBLANK(D630),\"Alain, nix drischribu\",VLOOKUP(D630,'2026'!$A$16:$G$161,3,FALSE))","v":"Bayard Medard & Gustav"},{"$f":"VLOOKUP(D630,'2026'!$A$16:$B$161,2,FALSE)","v":"Valerie"},5,40,{"$f":"VLOOKUP(E630,'2026'!$A$16:$G$161,2,FALSE)","v":"Pandora"},{"$f":"IF(ISBLANK(E630),\"hie eu nix drischribu\",VLOOKUP(E630,'2026'!$A$16:$G$161,3,FALSE))","v":"Lötscher Sandrine & Cédric"}]
["2026-06-14",{"$f":"IF(ISBLANK(D631),\"Alain, nix drischribu\",VLOOKUP(D631,'2026'!$A$16:$G$161,3,FALSE))","v":"Gebrüder Jäger"},{"$f":"VLOOKUP(D631,'2026'!$A$16:$B$161,2,FALSE)","v":"Betty Boop"},26,36,{"$f":"VLOOKUP(E631,'2026'!$A$16:$G$161,2,FALSE)","v":"Perle"},{"$f":"IF(ISBLANK(E631),\"hie eu nix drischribu\",VLOOKUP(E631,'2026'!$A$16:$G$161,3,FALSE))","v":"Lötscher Sandrine & Cédric"}]
["2026-06-14",{"$f":"IF(ISBLANK(D632),\"Alain, nix drischribu\",VLOOKUP(D632,'2026'!$A$16:$G$161,3,FALSE))","v":"Zumofen / Gattlen"},{"$f":"VLOOKUP(D632,'2026'!$A$16:$B$161,2,FALSE)","v":"Xea"},85,77,{"$f":"VLOOKUP(E632,'2026'!$A$16:$G$161,2,FALSE)","v":"Tirana"},{"$f":"IF(ISBLANK(E632),\"hie eu nix drischribu\",VLOOKUP(E632,'2026'!$A$16:$G$161,3,FALSE))","v":"Williner Anton"}]
["2026-06-14",{"$f":"IF(ISBLANK(D633),\"Alain, nix drischribu\",VLOOKUP(D633,'2026'!$A$16:$G$161,3,FALSE))","v":"Zumofen / Gattlen"},{"$f":"VLOOKUP(D633,'2026'!$A$16:$B$161,2,FALSE)","v":"Roquette"},86,40,{"$f":"VLOOKUP(E633,'2026'!$A$16:$G$161,2,FALSE)","v":"Pandora"},{"$f":"IF(ISBLANK(E633),\"hie eu nix drischribu\",VLOOKUP(E633,'2026'!$A$16:$G$161,3,FALSE))","v":"Lötscher Sandrine & Cédric"}]
["2026-06-14",{"$f":"IF(ISBLANK(D634),\"Alain, nix drischribu\",VLOOKUP(D634,'2026'!$A$16:$G$161,3,FALSE))","v":"Stallung Passeraub"},{"$f":"VLOOKUP(D634,'2026'!$A$16:$B$161,2,FALSE)","v":"Bandera"},69,81,{"$f":"VLOOKUP(E634,'2026'!$A$16:$G$161,2,FALSE)","v":"Souris"},{"$f":"IF(ISBLANK(E634),\"hie eu nix drischribu\",VLOOKUP(E634,'2026'!$A$16:$G$161,3,FALSE))","v":"Zumofen / Gattlen"}]
["2026-06-14",{"$f":"IF(ISBLANK(D635),\"Alain, nix drischribu\",VLOOKUP(D635,'2026'!$A$16:$G$161,3,FALSE))","v":"Zumofen / Gattlen"},{"$f":"VLOOKUP(D635,'2026'!$A$16:$B$161,2,FALSE)","v":"Xea"},85,4,{"$f":"VLOOKUP(E635,'2026'!$A$16:$G$161,2,FALSE)","v":"Vampir"},{"$f":"IF(ISBLANK(E635),\"hie eu nix drischribu\",VLOOKUP(E635,'2026'!$A$16:$G$161,3,FALSE))","v":"Bayard Medard & Gustav"}]
["2026-06-14",{"$f":"IF(ISBLANK(D636),\"Alain, nix drischribu\",VLOOKUP(D636,'2026'!$A$16:$G$161,3,FALSE))","v":"Stallung Jäger & Tscherrig"},{"$f":"VLOOKUP(D636,'2026'!$A$16:$B$161,2,FALSE)","v":"Santana"},52,81,{"$f":"VLOOKUP(E636,'2026'!$A$16:$G$161,2,FALSE)","v":"Souris"},{"$f":"IF(ISBLANK(E636),\"hie eu nix drischribu\",VLOOKUP(E636,'2026'!$A$16:$G$161,3,FALSE))","v":"Zumofen / Gattlen"}]
["2026-06-14",{"$f":"IF(ISBLANK(D637),\"Alain, nix drischribu\",VLOOKUP(D637,'2026'!$A$16:$G$161,3,FALSE))","v":"Stallung Passeraub"},{"$f":"VLOOKUP(D637,'2026'!$A$16:$B$161,2,FALSE)","v":"Bolienne"},68,67,{"$f":"VLOOKUP(E637,'2026'!$A$16:$G$161,2,FALSE)","v":"Boriana"},{"$f":"IF(ISBLANK(E637),\"hie eu nix drischribu\",VLOOKUP(E637,'2026'!$A$16:$G$161,3,FALSE))","v":"Stallung Passeraub"}]
["2026-06-14",{"$f":"IF(ISBLANK(D638),\"Alain, nix drischribu\",VLOOKUP(D638,'2026'!$A$16:$G$161,3,FALSE))","v":"Lötscher Sandrine & Cédric"},{"$f":"VLOOKUP(D638,'2026'!$A$16:$B$161,2,FALSE)","v":"Pandora"},40,45,{"$f":"VLOOKUP(E638,'2026'!$A$16:$G$161,2,FALSE)","v":"Cayenne"},{"$f":"IF(ISBLANK(E638),\"hie eu nix drischribu\",VLOOKUP(E638,'2026'!$A$16:$G$161,3,FALSE))","v":"Hischier H. & Bühlmann J."}]
["2026-06-14",{"$f":"IF(ISBLANK(D639),\"Alain, nix drischribu\",VLOOKUP(D639,'2026'!$A$16:$G$161,3,FALSE))","v":"Stallung Jäger & Tscherrig"},{"$f":"VLOOKUP(D639,'2026'!$A$16:$B$161,2,FALSE)","v":"Pixel"},58,93,{"$f":"VLOOKUP(E639,'2026'!$A$16:$G$161,2,FALSE)","v":"Farinelle"},{"$f":"IF(ISBLANK(E639),\"hie eu nix drischribu\",VLOOKUP(E639,'2026'!$A$16:$G$161,3,FALSE))","v":"Zumofen / Gattlen"}]
["2026-06-14",{"$f":"IF(ISBLANK(D640),\"Alain, nix drischribu\",VLOOKUP(D640,'2026'!$A$16:$G$161,3,FALSE))","v":"Stallung Mussmann"},{"$f":"VLOOKUP(D640,'2026'!$A$16:$B$161,2,FALSE)","v":"Mistral"},63,92,{"$f":"VLOOKUP(E640,'2026'!$A$16:$G$161,2,FALSE)","v":"Roseau"},{"$f":"IF(ISBLANK(E640),\"hie eu nix drischribu\",VLOOKUP(E640,'2026'!$A$16:$G$161,3,FALSE))","v":"Zumofen / Gattlen"}]
["2026-06-14",{"$f":"IF(ISBLANK(D641),\"Alain, nix drischribu\",VLOOKUP(D641,'2026'!$A$16:$G$161,3,FALSE))","v":"Hischier H. & Bühlmann J."},{"$f":"VLOOKUP(D641,'2026'!$A$16:$B$161,2,FALSE)","v":"Baghira"},43,58,{"$f":"VLOOKUP(E641,'2026'!$A$16:$G$161,2,FALSE)","v":"Pixel"},{"$f":"IF(ISBLANK(E641),\"hie eu nix drischribu\",VLOOKUP(E641,'2026'!$A$16:$G$161,3,FALSE))","v":"Stallung Jäger & Tscherrig"}]
["2026-06-14",{"$f":"IF(ISBLANK(D642),\"Alain, nix drischribu\",VLOOKUP(D642,'2026'!$A$16:$G$161,3,FALSE))","v":"Stallung Passeraub"},{"$f":"VLOOKUP(D642,'2026'!$A$16:$B$161,2,FALSE)","v":"Belle"},70,25,{"$f":"VLOOKUP(E642,'2026'!$A$16:$G$161,2,FALSE)","v":"Tirana"},{"$f":"IF(ISBLANK(E642),\"hie eu nix drischribu\",VLOOKUP(E642,'2026'!$A$16:$G$161,3,FALSE))","v":"Gebrüder Jäger"}]
["2026-06-14",{"$f":"IF(ISBLANK(D643),\"Alain, nix drischribu\",VLOOKUP(D643,'2026'!$A$16:$G$161,3,FALSE))","v":"Stallung Jäger & Tscherrig"},{"$f":"VLOOKUP(D643,'2026'!$A$16:$B$161,2,FALSE)","v":"Sina"},53,56,{"$f":"VLOOKUP(E643,'2026'!$A$16:$G$161,2,FALSE)","v":"Fanny"},{"$f":"IF(ISBLANK(E643),\"hie eu nix drischribu\",VLOOKUP(E643,'2026'!$A$16:$G$161,3,FALSE))","v":"Stallung Jäger & Tscherrig"}]
["2026-06-14",{"$f":"IF(ISBLANK(D644),\"Alain, nix drischribu\",VLOOKUP(D644,'2026'!$A$16:$G$161,3,FALSE))","v":"Geschwister Lötscher"},{"$f":"VLOOKUP(D644,'2026'!$A$16:$B$161,2,FALSE)","v":"Chips"},39,15,{"$f":"VLOOKUP(E644,'2026'!$A$16:$G$161,2,FALSE)","v":"Souma"},{"$f":"IF(ISBLANK(E644),\"hie eu nix drischribu\",VLOOKUP(E644,'2026'!$A$16:$G$161,3,FALSE))","v":"Bregy Uli, Lisi & Pascal"}]
["2026-06-14",{"$f":"IF(ISBLANK(D645),\"Alain, nix drischribu\",VLOOKUP(D645,'2026'!$A$16:$G$161,3,FALSE))","v":"Bregy Uli, Lisi & Pascal"},{"$f":"VLOOKUP(D645,'2026'!$A$16:$B$161,2,FALSE)","v":"Perona"},10,76,{"$f":"VLOOKUP(E645,'2026'!$A$16:$G$161,2,FALSE)","v":"Venus"},{"$f":"IF(ISBLANK(E645),\"hie eu nix drischribu\",VLOOKUP(E645,'2026'!$A$16:$G$161,3,FALSE))","v":"Williner Anton"}]
["2026-06-14",{"$f":"IF(ISBLANK(D646),\"Alain, nix drischribu\",VLOOKUP(D646,'2026'!$A$16:$G$161,3,FALSE))","v":"Lötscher Sandrine & Cédric"},{"$f":"VLOOKUP(D646,'2026'!$A$16:$B$161,2,FALSE)","v":"Pandora"},40,72,{"$f":"VLOOKUP(E646,'2026'!$A$16:$G$161,2,FALSE)","v":"Poseidon"},{"$f":"IF(ISBLANK(E646),\"hie eu nix drischribu\",VLOOKUP(E646,'2026'!$A$16:$G$161,3,FALSE))","v":"Hutter Richard"}]
["2026-06-14",{"$f":"IF(ISBLANK(D647),\"Alain, nix drischribu\",VLOOKUP(D647,'2026'!$A$16:$G$161,3,FALSE))","v":"Stallung Passeraub"},{"$f":"VLOOKUP(D647,'2026'!$A$16:$B$161,2,FALSE)","v":"Belle"},70,55,{"$f":"VLOOKUP(E647,'2026'!$A$16:$G$161,2,FALSE)","v":"Myla"},{"$f":"IF(ISBLANK(E647),\"hie eu nix drischribu\",VLOOKUP(E647,'2026'!$A$16:$G$161,3,FALSE))","v":"Stallung Jäger & Tscherrig"}]
["2026-06-14",{"$f":"IF(ISBLANK(D648),\"Alain, nix drischribu\",VLOOKUP(D648,'2026'!$A$16:$G$161,3,FALSE))","v":"Bayard Medard & Gustav"},{"$f":"VLOOKUP(D648,'2026'!$A$16:$B$161,2,FALSE)","v":"Vampir"},4,7,{"$f":"VLOOKUP(E648,'2026'!$A$16:$G$161,2,FALSE)","v":"Bilbao"},{"$f":"IF(ISBLANK(E648),\"hie eu nix drischribu\",VLOOKUP(E648,'2026'!$A$16:$G$161,3,FALSE))","v":"Bregy Alain"}]
["2026-06-14",{"$f":"IF(ISBLANK(D649),\"Alain, nix drischribu\",VLOOKUP(D649,'2026'!$A$16:$G$161,3,FALSE))","v":"Stallung Jäger & Tscherrig"},{"$f":"VLOOKUP(D649,'2026'!$A$16:$B$161,2,FALSE)","v":"Puma"},61,78,{"$f":"VLOOKUP(E649,'2026'!$A$16:$G$161,2,FALSE)","v":"Timba"},{"$f":"IF(ISBLANK(E649),\"hie eu nix drischribu\",VLOOKUP(E649,'2026'!$A$16:$G$161,3,FALSE))","v":"Williner Anton"}]
["2026-06-14",{"$f":"IF(ISBLANK(D650),\"Alain, nix drischribu\",VLOOKUP(D650,'2026'!$A$16:$G$161,3,FALSE))","v":"Hischier H. & Bühlmann J."},{"$f":"VLOOKUP(D650,'2026'!$A$16:$B$161,2,FALSE)","v":"Baghira"},43,37,{"$f":"VLOOKUP(E650,'2026'!$A$16:$G$161,2,FALSE)","v":"Cobra"},{"$f":"IF(ISBLANK(E650),\"hie eu nix drischribu\",VLOOKUP(E650,'2026'!$A$16:$G$161,3,FALSE))","v":"Geschwister Lötscher"}]
["2026-06-14",{"$f":"IF(ISBLANK(D651),\"Alain, nix drischribu\",VLOOKUP(D651,'2026'!$A$16:$G$161,3,FALSE))","v":"Gebrüder Jäger"},{"$f":"VLOOKUP(D651,'2026'!$A$16:$B$161,2,FALSE)","v":"Soraya"},23,17,{"$f":"VLOOKUP(E651,'2026'!$A$16:$G$161,2,FALSE)","v":"Panja"},{"$f":"IF(ISBLANK(E651),\"hie eu nix drischribu\",VLOOKUP(E651,'2026'!$A$16:$G$161,3,FALSE))","v":"Bregy Uli, Lisi & Pascal"}]
["2026-06-14",{"$f":"IF(ISBLANK(D652),\"Alain, nix drischribu\",VLOOKUP(D652,'2026'!$A$16:$G$161,3,FALSE))","v":"Gebrüder Jäger"},{"$f":"VLOOKUP(D652,'2026'!$A$16:$B$161,2,FALSE)","v":"Tamara"},24,46,{"$f":"VLOOKUP(E652,'2026'!$A$16:$G$161,2,FALSE)","v":"Cherico"},{"$f":"IF(ISBLANK(E652),\"hie eu nix drischribu\",VLOOKUP(E652,'2026'!$A$16:$G$161,3,FALSE))","v":"Lauber Noah & Jonas"}]
["2026-06-14",{"$f":"IF(ISBLANK(D653),\"Alain, nix drischribu\",VLOOKUP(D653,'2026'!$A$16:$G$161,3,FALSE))","v":"Bayard Medard & Gustav"},{"$f":"VLOOKUP(D653,'2026'!$A$16:$B$161,2,FALSE)","v":"Mamba"},2,77,{"$f":"VLOOKUP(E653,'2026'!$A$16:$G$161,2,FALSE)","v":"Tirana"},{"$f":"IF(ISBLANK(E653),\"hie eu nix drischribu\",VLOOKUP(E653,'2026'!$A$16:$G$161,3,FALSE))","v":"Williner Anton"}]
["2026-06-14",{"$f":"IF(ISBLANK(D654),\"Alain, nix drischribu\",VLOOKUP(D654,'2026'!$A$16:$G$161,3,FALSE))","v":"Williner Anton"},{"$f":"VLOOKUP(D654,'2026'!$A$16:$B$161,2,FALSE)","v":"Tirana"},77,27,{"$f":"VLOOKUP(E654,'2026'!$A$16:$G$161,2,FALSE)","v":"Silene"},{"$f":"IF(ISBLANK(E654),\"hie eu nix drischribu\",VLOOKUP(E654,'2026'!$A$16:$G$161,3,FALSE))","v":"Gebrüder Jäger"}]
["2026-06-14",{"$f":"IF(ISBLANK(D655),\"Alain, nix drischribu\",VLOOKUP(D655,'2026'!$A$16:$G$161,3,FALSE))","v":"Bayard Medard & Gustav"},{"$f":"VLOOKUP(D655,'2026'!$A$16:$B$161,2,FALSE)","v":"Mamba"},2,73,{"$f":"VLOOKUP(E655,'2026'!$A$16:$G$161,2,FALSE)","v":"Malice"},{"$f":"IF(ISBLANK(E655),\"hie eu nix drischribu\",VLOOKUP(E655,'2026'!$A$16:$G$161,3,FALSE))","v":"Stallung Passeraub"}]
["2026-06-14",{"$f":"IF(ISBLANK(D656),\"Alain, nix drischribu\",VLOOKUP(D656,'2026'!$A$16:$G$161,3,FALSE))","v":"Lötscher Sandrine & Cédric"},{"$f":"VLOOKUP(D656,'2026'!$A$16:$B$161,2,FALSE)","v":"Pouki"},33,10,{"$f":"VLOOKUP(E656,'2026'!$A$16:$G$161,2,FALSE)","v":"Perona"},{"$f":"IF(ISBLANK(E656),\"hie eu nix drischribu\",VLOOKUP(E656,'2026'!$A$16:$G$161,3,FALSE))","v":"Bregy Uli, Lisi & Pascal"}]
["2026-06-14",{"$f":"IF(ISBLANK(D657),\"Alain, nix drischribu\",VLOOKUP(D657,'2026'!$A$16:$G$161,3,FALSE))","v":"Familie Leiggener"},{"$f":"VLOOKUP(D657,'2026'!$A$16:$B$161,2,FALSE)","v":"Colette"},19,60,{"$f":"VLOOKUP(E657,'2026'!$A$16:$G$161,2,FALSE)","v":"Samoa"},{"$f":"IF(ISBLANK(E657),\"hie eu nix drischribu\",VLOOKUP(E657,'2026'!$A$16:$G$161,3,FALSE))","v":"Stallung Jäger & Tscherrig"}]
["2026-06-14",{"$f":"IF(ISBLANK(D658),\"Alain, nix drischribu\",VLOOKUP(D658,'2026'!$A$16:$G$161,3,FALSE))","v":"Zumofen / Gattlen"},{"$f":"VLOOKUP(D658,'2026'!$A$16:$B$161,2,FALSE)","v":"Farinelle"},93,74,{"$f":"VLOOKUP(E658,'2026'!$A$16:$G$161,2,FALSE)","v":"Brunette"},{"$f":"IF(ISBLANK(E658),\"hie eu nix drischribu\",VLOOKUP(E658,'2026'!$A$16:$G$161,3,FALSE))","v":"Stallung Passeraub"}]
["2026-06-14",{"$f":"IF(ISBLANK(D659),\"Alain, nix drischribu\",VLOOKUP(D659,'2026'!$A$16:$G$161,3,FALSE))","v":"Stallung Jäger & Tscherrig"},{"$f":"VLOOKUP(D659,'2026'!$A$16:$B$161,2,FALSE)","v":"Metis"},48,7,{"$f":"VLOOKUP(E659,'2026'!$A$16:$G$161,2,FALSE)","v":"Bilbao"},{"$f":"IF(ISBLANK(E659),\"hie eu nix drischribu\",VLOOKUP(E659,'2026'!$A$16:$G$161,3,FALSE))","v":"Bregy Alain"}]
["2026-06-14",{"$f":"IF(ISBLANK(D660),\"Alain, nix drischribu\",VLOOKUP(D660,'2026'!$A$16:$G$161,3,FALSE))","v":"Zumofen / Gattlen"},{"$f":"VLOOKUP(D660,'2026'!$A$16:$B$161,2,FALSE)","v":"Vergara"},91,56,{"$f":"VLOOKUP(E660,'2026'!$A$16:$G$161,2,FALSE)","v":"Fanny"},{"$f":"IF(ISBLANK(E660),\"hie eu nix drischribu\",VLOOKUP(E660,'2026'!$A$16:$G$161,3,FALSE))","v":"Stallung Jäger & Tscherrig"}]
["2026-06-14",{"$f":"IF(ISBLANK(D661),\"Alain, nix drischribu\",VLOOKUP(D661,'2026'!$A$16:$G$161,3,FALSE))","v":"Gebrüder Jäger"},{"$f":"VLOOKUP(D661,'2026'!$A$16:$B$161,2,FALSE)","v":"Soraya"},23,72,{"$f":"VLOOKUP(E661,'2026'!$A$16:$G$161,2,FALSE)","v":"Poseidon"},{"$f":"IF(ISBLANK(E661),\"hie eu nix drischribu\",VLOOKUP(E661,'2026'!$A$16:$G$161,3,FALSE))","v":"Hutter Richard"}]
["2026-06-14",{"$f":"IF(ISBLANK(D662),\"Alain, nix drischribu\",VLOOKUP(D662,'2026'!$A$16:$G$161,3,FALSE))","v":"Bayard Medard & Gustav"},{"$f":"VLOOKUP(D662,'2026'!$A$16:$B$161,2,FALSE)","v":"Vampir"},4,9,{"$f":"VLOOKUP(E662,'2026'!$A$16:$G$161,2,FALSE)","v":"Banja"},{"$f":"IF(ISBLANK(E662),\"hie eu nix drischribu\",VLOOKUP(E662,'2026'!$A$16:$G$161,3,FALSE))","v":"Bregy Alain"}]
["2026-06-14",{"$f":"IF(ISBLANK(D663),\"Alain, nix drischribu\",VLOOKUP(D663,'2026'!$A$16:$G$161,3,FALSE))","v":"Bregy Uli, Lisi & Pascal"},{"$f":"VLOOKUP(D663,'2026'!$A$16:$B$161,2,FALSE)","v":"Perona"},10,52,{"$f":"VLOOKUP(E663,'2026'!$A$16:$G$161,2,FALSE)","v":"Santana"},{"$f":"IF(ISBLANK(E663),\"hie eu nix drischribu\",VLOOKUP(E663,'2026'!$A$16:$G$161,3,FALSE))","v":"Stallung Jäger & Tscherrig"}]
["2026-06-14",{"$f":"IF(ISBLANK(D664),\"Alain, nix drischribu\",VLOOKUP(D664,'2026'!$A$16:$G$161,3,FALSE))","v":"Stallung Jäger & Tscherrig"},{"$f":"VLOOKUP(D664,'2026'!$A$16:$B$161,2,FALSE)","v":"Myla"},55,73,{"$f":"VLOOKUP(E664,'2026'!$A$16:$G$161,2,FALSE)","v":"Malice"},{"$f":"IF(ISBLANK(E664),\"hie eu nix drischribu\",VLOOKUP(E664,'2026'!$A$16:$G$161,3,FALSE))","v":"Stallung Passeraub"}]
["2026-06-14",{"$f":"IF(ISBLANK(D665),\"Alain, nix drischribu\",VLOOKUP(D665,'2026'!$A$16:$G$161,3,FALSE))","v":"Bregy Alain"},{"$f":"VLOOKUP(D665,'2026'!$A$16:$B$161,2,FALSE)","v":"Banja"},9,36,{"$f":"VLOOKUP(E665,'2026'!$A$16:$G$161,2,FALSE)","v":"Perle"},{"$f":"IF(ISBLANK(E665),\"hie eu nix drischribu\",VLOOKUP(E665,'2026'!$A$16:$G$161,3,FALSE))","v":"Lötscher Sandrine & Cédric"}]
["2026-06-14",{"$f":"IF(ISBLANK(D666),\"Alain, nix drischribu\",VLOOKUP(D666,'2026'!$A$16:$G$161,3,FALSE))","v":"Bregy Uli, Lisi & Pascal"},{"$f":"VLOOKUP(D666,'2026'!$A$16:$B$161,2,FALSE)","v":"Perona"},10,57,{"$f":"VLOOKUP(E666,'2026'!$A$16:$G$161,2,FALSE)","v":"Bogota"},{"$f":"IF(ISBLANK(E666),\"hie eu nix drischribu\",VLOOKUP(E666,'2026'!$A$16:$G$161,3,FALSE))","v":"Stallung Jäger & Tscherrig"}]
["2026-06-14",{"$f":"IF(ISBLANK(D667),\"Alain, nix drischribu\",VLOOKUP(D667,'2026'!$A$16:$G$161,3,FALSE))","v":"Stallung Jäger & Tscherrig"},{"$f":"VLOOKUP(D667,'2026'!$A$16:$B$161,2,FALSE)","v":"Santana"},52,77,{"$f":"VLOOKUP(E667,'2026'!$A$16:$G$161,2,FALSE)","v":"Tirana"},{"$f":"IF(ISBLANK(E667),\"hie eu nix drischribu\",VLOOKUP(E667,'2026'!$A$16:$G$161,3,FALSE))","v":"Williner Anton"}]
["2026-06-14",{"$f":"IF(ISBLANK(D668),\"Alain, nix drischribu\",VLOOKUP(D668,'2026'!$A$16:$G$161,3,FALSE))","v":"Bregy Alain"},{"$f":"VLOOKUP(D668,'2026'!$A$16:$B$161,2,FALSE)","v":"Bilbao"},7,73,{"$f":"VLOOKUP(E668,'2026'!$A$16:$G$161,2,FALSE)","v":"Malice"},{"$f":"IF(ISBLANK(E668),\"hie eu nix drischribu\",VLOOKUP(E668,'2026'!$A$16:$G$161,3,FALSE))","v":"Stallung Passeraub"}]
["2026-06-14",{"$f":"IF(ISBLANK(D669),\"Alain, nix drischribu\",VLOOKUP(D669,'2026'!$A$16:$G$161,3,FALSE))","v":"Stallung Passeraub"},{"$f":"VLOOKUP(D669,'2026'!$A$16:$B$161,2,FALSE)","v":"Beluga"},66,60,{"$f":"VLOOKUP(E669,'2026'!$A$16:$G$161,2,FALSE)","v":"Samoa"},{"$f":"IF(ISBLANK(E669),\"hie eu nix drischribu\",VLOOKUP(E669,'2026'!$A$16:$G$161,3,FALSE))","v":"Stallung Jäger & Tscherrig"}]
["2026-06-14",{"$f":"IF(ISBLANK(D670),\"Alain, nix drischribu\",VLOOKUP(D670,'2026'!$A$16:$G$161,3,FALSE))","v":"Bregy Uli, Lisi & Pascal"},{"$f":"VLOOKUP(D670,'2026'!$A$16:$B$161,2,FALSE)","v":"Belle"},16,51,{"$f":"VLOOKUP(E670,'2026'!$A$16:$G$161,2,FALSE)","v":"Bijou"},{"$f":"IF(ISBLANK(E670),\"hie eu nix drischribu\",VLOOKUP(E670,'2026'!$A$16:$G$161,3,FALSE))","v":"Stallung Jäger & Tscherrig"}]
["2026-06-14",{"$f":"IF(ISBLANK(D671),\"Alain, nix drischribu\",VLOOKUP(D671,'2026'!$A$16:$G$161,3,FALSE))","v":"Stallung Jäger & Tscherrig"},{"$f":"VLOOKUP(D671,'2026'!$A$16:$B$161,2,FALSE)","v":"Fanny"},56,27,{"$f":"VLOOKUP(E671,'2026'!$A$16:$G$161,2,FALSE)","v":"Silene"},{"$f":"IF(ISBLANK(E671),\"hie eu nix drischribu\",VLOOKUP(E671,'2026'!$A$16:$G$161,3,FALSE))","v":"Gebrüder Jäger"}]
["2026-06-14",{"$f":"IF(ISBLANK(D672),\"Alain, nix drischribu\",VLOOKUP(D672,'2026'!$A$16:$G$161,3,FALSE))","v":"Geschwister Lötscher"},{"$f":"VLOOKUP(D672,'2026'!$A$16:$B$161,2,FALSE)","v":"Cobra"},37,8,{"$f":"VLOOKUP(E672,'2026'!$A$16:$G$161,2,FALSE)","v":"Valesia"},{"$f":"IF(ISBLANK(E672),\"hie eu nix drischribu\",VLOOKUP(E672,'2026'!$A$16:$G$161,3,FALSE))","v":"Bregy Alain"}]
["2026-06-14",{"$f":"IF(ISBLANK(D673),\"Alain, nix drischribu\",VLOOKUP(D673,'2026'!$A$16:$G$161,3,FALSE))","v":"Bregy Uli, Lisi & Pascal"},{"$f":"VLOOKUP(D673,'2026'!$A$16:$B$161,2,FALSE)","v":"Samba"},14,40,{"$f":"VLOOKUP(E673,'2026'!$A$16:$G$161,2,FALSE)","v":"Pandora"},{"$f":"IF(ISBLANK(E673),\"hie eu nix drischribu\",VLOOKUP(E673,'2026'!$A$16:$G$161,3,FALSE))","v":"Lötscher Sandrine & Cédric"}]
["2026-06-14",{"$f":"IF(ISBLANK(D674),\"Alain, nix drischribu\",VLOOKUP(D674,'2026'!$A$16:$G$161,3,FALSE))","v":"Bregy Uli, Lisi & Pascal"},{"$f":"VLOOKUP(D674,'2026'!$A$16:$B$161,2,FALSE)","v":"Perona"},10,55,{"$f":"VLOOKUP(E674,'2026'!$A$16:$G$161,2,FALSE)","v":"Myla"},{"$f":"IF(ISBLANK(E674),\"hie eu nix drischribu\",VLOOKUP(E674,'2026'!$A$16:$G$161,3,FALSE))","v":"Stallung Jäger & Tscherrig"}]
["2026-06-14",{"$f":"IF(ISBLANK(D675),\"Alain, nix drischribu\",VLOOKUP(D675,'2026'!$A$16:$G$161,3,FALSE))","v":"Stallung Passeraub"},{"$f":"VLOOKUP(D675,'2026'!$A$16:$B$161,2,FALSE)","v":"Belle"},70,18,{"$f":"VLOOKUP(E675,'2026'!$A$16:$G$161,2,FALSE)","v":"Calina"},{"$f":"IF(ISBLANK(E675),\"hie eu nix drischribu\",VLOOKUP(E675,'2026'!$A$16:$G$161,3,FALSE))","v":"Bregy Uli, Lisi & Pascal"}]
["2026-06-14",{"$f":"IF(ISBLANK(D676),\"Alain, nix drischribu\",VLOOKUP(D676,'2026'!$A$16:$G$161,3,FALSE))","v":"Bregy Uli, Lisi & Pascal"},{"$f":"VLOOKUP(D676,'2026'!$A$16:$B$161,2,FALSE)","v":"Perona"},10,39,{"$f":"VLOOKUP(E676,'2026'!$A$16:$G$161,2,FALSE)","v":"Chips"},{"$f":"IF(ISBLANK(E676),\"hie eu nix drischribu\",VLOOKUP(E676,'2026'!$A$16:$G$161,3,FALSE))","v":"Geschwister Lötscher"}]
["2026-06-14",{"$f":"IF(ISBLANK(D677),\"Alain, nix drischribu\",VLOOKUP(D677,'2026'!$A$16:$G$161,3,FALSE))","v":"Stallung Passeraub"},{"$f":"VLOOKUP(D677,'2026'!$A$16:$B$161,2,FALSE)","v":"Belana"},65,55,{"$f":"VLOOKUP(E677,'2026'!$A$16:$G$161,2,FALSE)","v":"Myla"},{"$f":"IF(ISBLANK(E677),\"hie eu nix drischribu\",VLOOKUP(E677,'2026'!$A$16:$G$161,3,FALSE))","v":"Stallung Jäger & Tscherrig"}]
["2026-06-14",{"$f":"IF(ISBLANK(D678),\"Alain, nix drischribu\",VLOOKUP(D678,'2026'!$A$16:$G$161,3,FALSE))","v":"Geschwister Lötscher"},{"$f":"VLOOKUP(D678,'2026'!$A$16:$B$161,2,FALSE)","v":"Cobra"},37,16,{"$f":"VLOOKUP(E678,'2026'!$A$16:$G$161,2,FALSE)","v":"Belle"},{"$f":"IF(ISBLANK(E678),\"hie eu nix drischribu\",VLOOKUP(E678,'2026'!$A$16:$G$161,3,FALSE))","v":"Bregy Uli, Lisi & Pascal"}]
["2026-06-14",{"$f":"IF(ISBLANK(D679),\"Alain, nix drischribu\",VLOOKUP(D679,'2026'!$A$16:$G$161,3,FALSE))","v":"Stallung Jäger & Tscherrig"},{"$f":"VLOOKUP(D679,'2026'!$A$16:$B$161,2,FALSE)","v":"Myla"},55,64,{"$f":"VLOOKUP(E679,'2026'!$A$16:$G$161,2,FALSE)","v":"Bonita"},{"$f":"IF(ISBLANK(E679),\"hie eu nix drischribu\",VLOOKUP(E679,'2026'!$A$16:$G$161,3,FALSE))","v":"Stallung Passeraub"}]
["2026-06-14",{"$f":"IF(ISBLANK(D680),\"Alain, nix drischribu\",VLOOKUP(D680,'2026'!$A$16:$G$161,3,FALSE))","v":"Bregy Alain"},{"$f":"VLOOKUP(D680,'2026'!$A$16:$B$161,2,FALSE)","v":"Bilbao"},7,2,{"$f":"VLOOKUP(E680,'2026'!$A$16:$G$161,2,FALSE)","v":"Mamba"},{"$f":"IF(ISBLANK(E680),\"hie eu nix drischribu\",VLOOKUP(E680,'2026'!$A$16:$G$161,3,FALSE))","v":"Bayard Medard & Gustav"}]
["2026-06-14",{"$f":"IF(ISBLANK(D681),\"Alain, nix drischribu\",VLOOKUP(D681,'2026'!$A$16:$G$161,3,FALSE))","v":"Zumofen / Gattlen"},{"$f":"VLOOKUP(D681,'2026'!$A$16:$B$161,2,FALSE)","v":"Vergara"},91,75,{"$f":"VLOOKUP(E681,'2026'!$A$16:$G$161,2,FALSE)","v":"Baldrun"},{"$f":"IF(ISBLANK(E681),\"hie eu nix drischribu\",VLOOKUP(E681,'2026'!$A$16:$G$161,3,FALSE))","v":"Stallung Passeraub"}]
["2026-06-14",{"$f":"IF(ISBLANK(D682),\"Alain, nix drischribu\",VLOOKUP(D682,'2026'!$A$16:$G$161,3,FALSE))","v":"Stallung Passeraub"},{"$f":"VLOOKUP(D682,'2026'!$A$16:$B$161,2,FALSE)","v":"Bonita"},64,91,{"$f":"VLOOKUP(E682,'2026'!$A$16:$G$161,2,FALSE)","v":"Vergara"},{"$f":"IF(ISBLANK(E682),\"hie eu nix drischribu\",VLOOKUP(E682,'2026'!$A$16:$G$161,3,FALSE))","v":"Zumofen / Gattlen"}]
["2026-06-14",{"$f":"IF(ISBLANK(D683),\"Alain, nix drischribu\",VLOOKUP(D683,'2026'!$A$16:$G$161,3,FALSE))","v":"Stallung Jäger & Tscherrig"},{"$f":"VLOOKUP(D683,'2026'!$A$16:$B$161,2,FALSE)","v":"Myla"},55,71,{"$f":"VLOOKUP(E683,'2026'!$A$16:$G$161,2,FALSE)","v":"Fiona"},{"$f":"IF(ISBLANK(E683),\"hie eu nix drischribu\",VLOOKUP(E683,'2026'!$A$16:$G$161,3,FALSE))","v":"Hutter Richard"}]
["2026-06-14",{"$f":"IF(ISBLANK(D684),\"Alain, nix drischribu\",VLOOKUP(D684,'2026'!$A$16:$G$161,3,FALSE))","v":"Stallung Mussmann"},{"$f":"VLOOKUP(D684,'2026'!$A$16:$B$161,2,FALSE)","v":"Xenia"},62,56,{"$f":"VLOOKUP(E684,'2026'!$A$16:$G$161,2,FALSE)","v":"Fanny"},{"$f":"IF(ISBLANK(E684),\"hie eu nix drischribu\",VLOOKUP(E684,'2026'!$A$16:$G$161,3,FALSE))","v":"Stallung Jäger & Tscherrig"}]
["2026-06-14",{"$f":"IF(ISBLANK(D685),\"Alain, nix drischribu\",VLOOKUP(D685,'2026'!$A$16:$G$161,3,FALSE))","v":"Familie Leiggener"},{"$f":"VLOOKUP(D685,'2026'!$A$16:$B$161,2,FALSE)","v":"Royale"},21,50,{"$f":"VLOOKUP(E685,'2026'!$A$16:$G$161,2,FALSE)","v":"Beline"},{"$f":"IF(ISBLANK(E685),\"hie eu nix drischribu\",VLOOKUP(E685,'2026'!$A$16:$G$161,3,FALSE))","v":"Stallung Jäger & Tscherrig"}]
["2026-06-14",{"$f":"IF(ISBLANK(D686),\"Alain, nix drischribu\",VLOOKUP(D686,'2026'!$A$16:$G$161,3,FALSE))","v":"Stallung Passeraub"},{"$f":"VLOOKUP(D686,'2026'!$A$16:$B$161,2,FALSE)","v":"Beluga"},66,57,{"$f":"VLOOKUP(E686,'2026'!$A$16:$G$161,2,FALSE)","v":"Bogota"},{"$f":"IF(ISBLANK(E686),\"hie eu nix drischribu\",VLOOKUP(E686,'2026'!$A$16:$G$161,3,FALSE))","v":"Stallung Jäger & Tscherrig"}]
["2026-06-14",{"$f":"IF(ISBLANK(D687),\"Alain, nix drischribu\",VLOOKUP(D687,'2026'!$A$16:$G$161,3,FALSE))","v":"Familie Leiggener"},{"$f":"VLOOKUP(D687,'2026'!$A$16:$B$161,2,FALSE)","v":"Tyson"},22,26,{"$f":"VLOOKUP(E687,'2026'!$A$16:$G$161,2,FALSE)","v":"Betty Boop"},{"$f":"IF(ISBLANK(E687),\"hie eu nix drischribu\",VLOOKUP(E687,'2026'!$A$16:$G$161,3,FALSE))","v":"Gebrüder Jäger"}]
["2026-06-14",{"$f":"IF(ISBLANK(D688),\"Alain, nix drischribu\",VLOOKUP(D688,'2026'!$A$16:$G$161,3,FALSE))","v":"Gebrüder Jäger"},{"$f":"VLOOKUP(D688,'2026'!$A$16:$B$161,2,FALSE)","v":"Betty Boop"},26,50,{"$f":"VLOOKUP(E688,'2026'!$A$16:$G$161,2,FALSE)","v":"Beline"},{"$f":"IF(ISBLANK(E688),\"hie eu nix drischribu\",VLOOKUP(E688,'2026'!$A$16:$G$161,3,FALSE))","v":"Stallung Jäger & Tscherrig"}]
["2026-06-14",{"$f":"IF(ISBLANK(D689),\"Alain, nix drischribu\",VLOOKUP(D689,'2026'!$A$16:$G$161,3,FALSE))","v":"Bregy Uli, Lisi & Pascal"},{"$f":"VLOOKUP(D689,'2026'!$A$16:$B$161,2,FALSE)","v":"Souma"},15,35,{"$f":"VLOOKUP(E689,'2026'!$A$16:$G$161,2,FALSE)","v":"Cartouche"},{"$f":"IF(ISBLANK(E689),\"hie eu nix drischribu\",VLOOKUP(E689,'2026'!$A$16:$G$161,3,FALSE))","v":"Geschwister Lötscher"}]
["2026-06-14",{"$f":"IF(ISBLANK(D690),\"Alain, nix drischribu\",VLOOKUP(D690,'2026'!$A$16:$G$161,3,FALSE))","v":"Stallung Jäger & Tscherrig"},{"$f":"VLOOKUP(D690,'2026'!$A$16:$B$161,2,FALSE)","v":"Myla"},55,22,{"$f":"VLOOKUP(E690,'2026'!$A$16:$G$161,2,FALSE)","v":"Tyson"},{"$f":"IF(ISBLANK(E690),\"hie eu nix drischribu\",VLOOKUP(E690,'2026'!$A$16:$G$161,3,FALSE))","v":"Familie Leiggener"}]
["2026-06-14",{"$f":"IF(ISBLANK(D691),\"Alain, nix drischribu\",VLOOKUP(D691,'2026'!$A$16:$G$161,3,FALSE))","v":"Hischier H. & Bühlmann J."},{"$f":"VLOOKUP(D691,'2026'!$A$16:$B$161,2,FALSE)","v":"Baghira"},43,58,{"$f":"VLOOKUP(E691,'2026'!$A$16:$G$161,2,FALSE)","v":"Pixel"},{"$f":"IF(ISBLANK(E691),\"hie eu nix drischribu\",VLOOKUP(E691,'2026'!$A$16:$G$161,3,FALSE))","v":"Stallung Jäger & Tscherrig"}]
["2026-06-14",{"$f":"IF(ISBLANK(D692),\"Alain, nix drischribu\",VLOOKUP(D692,'2026'!$A$16:$G$161,3,FALSE))","v":"Stallung Jäger & Tscherrig"},{"$f":"VLOOKUP(D692,'2026'!$A$16:$B$161,2,FALSE)","v":"Samoa"},60,44,{"$f":"VLOOKUP(E692,'2026'!$A$16:$G$161,2,FALSE)","v":"Tara"},{"$f":"IF(ISBLANK(E692),\"hie eu nix drischribu\",VLOOKUP(E692,'2026'!$A$16:$G$161,3,FALSE))","v":"Hischier H. & Bühlmann J."}]
["2026-06-14",{"$f":"IF(ISBLANK(D693),\"Alain, nix drischribu\",VLOOKUP(D693,'2026'!$A$16:$G$161,3,FALSE))","v":"Stallung Passeraub"},{"$f":"VLOOKUP(D693,'2026'!$A$16:$B$161,2,FALSE)","v":"Bandera"},69,60,{"$f":"VLOOKUP(E693,'2026'!$A$16:$G$161,2,FALSE)","v":"Samoa"},{"$f":"IF(ISBLANK(E693),\"hie eu nix drischribu\",VLOOKUP(E693,'2026'!$A$16:$G$161,3,FALSE))","v":"Stallung Jäger & Tscherrig"}]
["2026-06-14",{"$f":"IF(ISBLANK(D694),\"Alain, nix drischribu\",VLOOKUP(D694,'2026'!$A$16:$G$161,3,FALSE))","v":"Stallung Jäger & Tscherrig"},{"$f":"VLOOKUP(D694,'2026'!$A$16:$B$161,2,FALSE)","v":"Bogota"},57,74,{"$f":"VLOOKUP(E694,'2026'!$A$16:$G$161,2,FALSE)","v":"Brunette"},{"$f":"IF(ISBLANK(E694),\"hie eu nix drischribu\",VLOOKUP(E694,'2026'!$A$16:$G$161,3,FALSE))","v":"Stallung Passeraub"}]
["2026-06-14",{"$f":"IF(ISBLANK(D695),\"Alain, nix drischribu\",VLOOKUP(D695,'2026'!$A$16:$G$161,3,FALSE))","v":"Zumofen / Gattlen"},{"$f":"VLOOKUP(D695,'2026'!$A$16:$B$161,2,FALSE)","v":"Souris"},81,73,{"$f":"VLOOKUP(E695,'2026'!$A$16:$G$161,2,FALSE)","v":"Malice"},{"$f":"IF(ISBLANK(E695),\"hie eu nix drischribu\",VLOOKUP(E695,'2026'!$A$16:$G$161,3,FALSE))","v":"Stallung Passeraub"}]
["2026-06-14",{"$f":"IF(ISBLANK(D696),\"Alain, nix drischribu\",VLOOKUP(D696,'2026'!$A$16:$G$161,3,FALSE))","v":"Williner Anton"},{"$f":"VLOOKUP(D696,'2026'!$A$16:$B$161,2,FALSE)","v":"Tirana"},77,50,{"$f":"VLOOKUP(E696,'2026'!$A$16:$G$161,2,FALSE)","v":"Beline"},{"$f":"IF(ISBLANK(E696),\"hie eu nix drischribu\",VLOOKUP(E696,'2026'!$A$16:$G$161,3,FALSE))","v":"Stallung Jäger & Tscherrig"}]
["2026-06-14",{"$f":"IF(ISBLANK(D697),\"Alain, nix drischribu\",VLOOKUP(D697,'2026'!$A$16:$G$161,3,FALSE))","v":"Stallung Jäger & Tscherrig"},{"$f":"VLOOKUP(D697,'2026'!$A$16:$B$161,2,FALSE)","v":"Fanny"},56,72,{"$f":"VLOOKUP(E697,'2026'!$A$16:$G$161,2,FALSE)","v":"Poseidon"},{"$f":"IF(ISBLANK(E697),\"hie eu nix drischribu\",VLOOKUP(E697,'2026'!$A$16:$G$161,3,FALSE))","v":"Hutter Richard"}]
["2026-06-14",{"$f":"IF(ISBLANK(D698),\"Alain, nix drischribu\",VLOOKUP(D698,'2026'!$A$16:$G$161,3,FALSE))","v":"Stallung Jäger & Tscherrig"},{"$f":"VLOOKUP(D698,'2026'!$A$16:$B$161,2,FALSE)","v":"Puma"},61,10,{"$f":"VLOOKUP(E698,'2026'!$A$16:$G$161,2,FALSE)","v":"Perona"},{"$f":"IF(ISBLANK(E698),\"hie eu nix drischribu\",VLOOKUP(E698,'2026'!$A$16:$G$161,3,FALSE))","v":"Bregy Uli, Lisi & Pascal"}]
["2026-06-14",{"$f":"IF(ISBLANK(D699),\"Alain, nix drischribu\",VLOOKUP(D699,'2026'!$A$16:$G$161,3,FALSE))","v":"Williner Anton"},{"$f":"VLOOKUP(D699,'2026'!$A$16:$B$161,2,FALSE)","v":"Venus"},76,60,{"$f":"VLOOKUP(E699,'2026'!$A$16:$G$161,2,FALSE)","v":"Samoa"},{"$f":"IF(ISBLANK(E699),\"hie eu nix drischribu\",VLOOKUP(E699,'2026'!$A$16:$G$161,3,FALSE))","v":"Stallung Jäger & Tscherrig"}]
["2026-06-14",{"$f":"IF(ISBLANK(D700),\"Alain, nix drischribu\",VLOOKUP(D700,'2026'!$A$16:$G$161,3,FALSE))","v":"Familie Leiggener"},{"$f":"VLOOKUP(D700,'2026'!$A$16:$B$161,2,FALSE)","v":"Tyson"},22,54,{"$f":"VLOOKUP(E700,'2026'!$A$16:$G$161,2,FALSE)","v":"Pinga"},{"$f":"IF(ISBLANK(E700),\"hie eu nix drischribu\",VLOOKUP(E700,'2026'!$A$16:$G$161,3,FALSE))","v":"Stallung Jäger & Tscherrig"}]
["2026-06-14",{"$f":"IF(ISBLANK(D701),\"Alain, nix drischribu\",VLOOKUP(D701,'2026'!$A$16:$G$161,3,FALSE))","v":"Familie Leiggener"},{"$f":"VLOOKUP(D701,'2026'!$A$16:$B$161,2,FALSE)","v":"Colette"},19,60,{"$f":"VLOOKUP(E701,'2026'!$A$16:$G$161,2,FALSE)","v":"Samoa"},{"$f":"IF(ISBLANK(E701),\"hie eu nix drischribu\",VLOOKUP(E701,'2026'!$A$16:$G$161,3,FALSE))","v":"Stallung Jäger & Tscherrig"}]
["2026-06-14",{"$f":"IF(ISBLANK(D702),\"Alain, nix drischribu\",VLOOKUP(D702,'2026'!$A$16:$G$161,3,FALSE))","v":"Stallung Jäger & Tscherrig"},{"$f":"VLOOKUP(D702,'2026'!$A$16:$B$161,2,FALSE)","v":"Metis"},48,70,{"$f":"VLOOKUP(E702,'2026'!$A$16:$G$161,2,FALSE)","v":"Belle"},{"$f":"IF(ISBLANK(E702),\"hie eu nix drischribu\",VLOOKUP(E702,'2026'!$A$16:$G$161,3,FALSE))","v":"Stallung Passeraub"}]
["2026-06-14",{"$f":"IF(ISBLANK(D703),\"Alain, nix drischribu\",VLOOKUP(D703,'2026'!$A$16:$G$161,3,FALSE))","v":"Stallung Passeraub"},{"$f":"VLOOKUP(D703,'2026'!$A$16:$B$161,2,FALSE)","v":"Belle"},70,17,{"$f":"VLOOKUP(E703,'2026'!$A$16:$G$161,2,FALSE)","v":"Panja"},{"$f":"IF(ISBLANK(E703),\"hie eu nix drischribu\",VLOOKUP(E703,'2026'!$A$16:$G$161,3,FALSE))","v":"Bregy Uli, Lisi & Pascal"}]
[null,{"$f":"IF(ISBLANK(D704),\"Alain, nix drischribu\",VLOOKUP(D704,'2026'!$A$16:$G$161,3,FALSE))","v":"Alain, nix drischribu"},{"$f":"VLOOKUP(D704,'2026'!$A$16:$B$161,2,FALSE)","v":{"$error":"#N/A"}},null,null,{"$f":"VLOOKUP(E704,'2026'!$A$16:$G$161,2,FALSE)","v":{"$error":"#N/A"}},{"$f":"IF(ISBLANK(E704),\"hie eu nix drischribu\",VLOOKUP(E704,'2026'!$A$16:$G$161,3,FALSE))","v":"hie eu nix drischribu"}]
[null,{"$f":"IF(ISBLANK(D705),\"Alain, nix drischribu\",VLOOKUP(D705,'2026'!$A$16:$G$161,3,FALSE))","v":"Alain, nix drischribu"},{"$f":"VLOOKUP(D705,'2026'!$A$16:$B$161,2,FALSE)","v":{"$error":"#N/A"}},null,null,{"$f":"VLOOKUP(E705,'2026'!$A$16:$G$161,2,FALSE)","v":{"$error":"#N/A"}},{"$f":"IF(ISBLANK(E705),\"hie eu nix drischribu\",VLOOKUP(E705,'2026'!$A$16:$G$161,3,FALSE))","v":"hie eu nix drischribu"}]
[null,{"$f":"IF(ISBLANK(D706),\"Alain, nix drischribu\",VLOOKUP(D706,'2026'!$A$16:$G$161,3,FALSE))","v":"Alain, nix drischribu"},{"$f":"VLOOKUP(D706,'2026'!$A$16:$B$161,2,FALSE)","v":{"$error":"#N/A"}},null,null,{"$f":"VLOOKUP(E706,'2026'!$A$16:$G$161,2,FALSE)","v":{"$error":"#N/A"}},{"$f":"IF(ISBLANK(E706),\"hie eu nix drischribu\",VLOOKUP(E706,'2026'!$A$16:$G$161,3,FALSE))","v":"hie eu nix drischribu"}]
[null,{"$f":"IF(ISBLANK(D707),\"Alain, nix drischribu\",VLOOKUP(D707,'2026'!$A$16:$G$161,3,FALSE))","v":"Alain, nix drischribu"},{"$f":"VLOOKUP(D707,'2026'!$A$16:$B$161,2,FALSE)","v":{"$error":"#N/A"}},null,null,{"$f":"VLOOKUP(E707,'2026'!$A$16:$G$161,2,FALSE)","v":{"$error":"#N/A"}},{"$f":"IF(ISBLANK(E707),\"hie eu nix drischribu\",VLOOKUP(E707,'2026'!$A$16:$G$161,3,FALSE))","v":"hie eu nix drischribu"}]
[null,{"$f":"IF(ISBLANK(D708),\"Alain, nix drischribu\",VLOOKUP(D708,'2026'!$A$16:$G$161,3,FALSE))","v":"Alain, nix drischribu"},{"$f":"VLOOKUP(D708,'2026'!$A$16:$B$161,2,FALSE)","v":{"$error":"#N/A"}},null,null,{"$f":"VLOOKUP(E708,'2026'!$A$16:$G$161,2,FALSE)","v":{"$error":"#N/A"}},{"$f":"IF(ISBLANK(E708),\"hie eu nix drischribu\",VLOOKUP(E708,'2026'!$A$16:$G$161,3,FALSE))","v":"hie eu nix drischribu"}]
[null,{"$f":"IF(ISBLANK(D709),\"Alain, nix drischribu\",VLOOKUP(D709,'2026'!$A$16:$G$161,3,FALSE))","v":"Alain, nix drischribu"},{"$f":"VLOOKUP(D709,'2026'!$A$16:$B$161,2,FALSE)","v":{"$error":"#N/A"}},null,null,{"$f":"VLOOKUP(E709,'2026'!$A$16:$G$161,2,FALSE)","v":{"$error":"#N/A"}},{"$f":"IF(ISBLANK(E709),\"hie eu nix drischribu\",VLOOKUP(E709,'2026'!$A$16:$G$161,3,FALSE))","v":"hie eu nix drischribu"}]
[null,{"$f":"IF(ISBLANK(D710),\"Alain, nix drischribu\",VLOOKUP(D710,'2026'!$A$16:$G$161,3,FALSE))","v":"Alain, nix drischribu"},{"$f":"VLOOKUP(D710,'2026'!$A$16:$B$161,2,FALSE)","v":{"$error":"#N/A"}},null,null,{"$f":"VLOOKUP(E710,'2026'!$A$16:$G$161,2,FALSE)","v":{"$error":"#N/A"}},{"$f":"IF(ISBLANK(E710),\"hie eu nix drischribu\",VLOOKUP(E710,'2026'!$A$16:$G$161,3,FALSE))","v":"hie eu nix drischribu"}]
[null,{"$f":"IF(ISBLANK(D711),\"Alain, nix drischribu\",VLOOKUP(D711,'2026'!$A$16:$G$161,3,FALSE))","v":"Alain, nix drischribu"},{"$f":"VLOOKUP(D711,'2026'!$A$16:$B$161,2,FALSE)","v":{"$error":"#N/A"}},null,null,{"$f":"VLOOKUP(E711,'2026'!$A$16:$G$161,2,FALSE)","v":{"$error":"#N/A"}},{"$f":"IF(ISBLANK(E711),\"hie eu nix drischribu\",VLOOKUP(E711,'2026'!$A$16:$G$161,3,FALSE))","v":"hie eu nix drischribu"}]
[null,{"$f":"IF(ISBLANK(D712),\"Alain, nix drischribu\",VLOOKUP(D712,'2026'!$A$16:$G$161,3,FALSE))","v":"Alain, nix drischribu"},{"$f":"VLOOKUP(D712,'2026'!$A$16:$B$161,2,FALSE)","v":{"$error":"#N/A"}},null,null,{"$f":"VLOOKUP(E712,'2026'!$A$16:$G$161,2,FALSE)","v":{"$error":"#N/A"}},{"$f":"IF(ISBLANK(E712),\"hie eu nix drischribu\",VLOOKUP(E712,'2026'!$A$16:$G$161,3,FALSE))","v":"hie eu nix drischribu"}]
[null,{"$f":"IF(ISBLANK(D713),\"Alain, nix drischribu\",VLOOKUP(D713,'2026'!$A$16:$G$161,3,FALSE))","v":"Alain, nix drischribu"},{"$f":"VLOOKUP(D713,'2026'!$A$16:$B$161,2,FALSE)","v":{"$error":"#N/A"}},null,null,{"$f":"VLOOKUP(E713,'2026'!$A$16:$G$161,2,FALSE)","v":{"$error":"#N/A"}},{"$f":"IF(ISBLANK(E713),\"hie eu nix drischribu\",VLOOKUP(E713,'2026'!$A$16:$G$161,3,FALSE))","v":"hie eu nix drischribu"}]
[null,{"$f":"IF(ISBLANK(D714),\"Alain, nix drischribu\",VLOOKUP(D714,'2026'!$A$16:$G$161,3,FALSE))","v":"Alain, nix drischribu"},{"$f":"VLOOKUP(D714,'2026'!$A$16:$B$161,2,FALSE)","v":{"$error":"#N/A"}},null,null,{"$f":"VLOOKUP(E714,'2026'!$A$16:$G$161,2,FALSE)","v":{"$error":"#N/A"}},{"$f":"IF(ISBLANK(E714),\"hie eu nix drischribu\",VLOOKUP(E714,'2026'!$A$16:$G$161,3,FALSE))","v":"hie eu nix drischribu"}]
[null,{"$f":"IF(ISBLANK(D715),\"Alain, nix drischribu\",VLOOKUP(D715,'2026'!$A$16:$G$161,3,FALSE))","v":"Alain, nix drischribu"},{"$f":"VLOOKUP(D715,'2026'!$A$16:$B$161,2,FALSE)","v":{"$error":"#N/A"}},null,null,{"$f":"VLOOKUP(E715,'2026'!$A$16:$G$161,2,FALSE)","v":{"$error":"#N/A"}},{"$f":"IF(ISBLANK(E715),\"hie eu nix drischribu\",VLOOKUP(E715,'2026'!$A$16:$G$161,3,FALSE))","v":"hie eu nix drischribu"}]
[null,{"$f":"IF(ISBLANK(D716),\"Alain, nix drischribu\",VLOOKUP(D716,'2026'!$A$16:$G$161,3,FALSE))","v":"Alain, nix drischribu"},{"$f":"VLOOKUP(D716,'2026'!$A$16:$B$161,2,FALSE)","v":{"$error":"#N/A"}},null,null,{"$f":"VLOOKUP(E716,'2026'!$A$16:$G$161,2,FALSE)","v":{"$error":"#N/A"}},{"$f":"IF(ISBLANK(E716),\"hie eu nix drischribu\",VLOOKUP(E716,'2026'!$A$16:$G$161,3,FALSE))","v":"hie eu nix drischribu"}]
[null,{"$f":"IF(ISBLANK(D717),\"Alain, nix drischribu\",VLOOKUP(D717,'2026'!$A$16:$G$161,3,FALSE))","v":"Alain, nix drischribu"},{"$f":"VLOOKUP(D717,'2026'!$A$16:$B$161,2,FALSE)","v":{"$error":"#N/A"}},null,null,{"$f":"VLOOKUP(E717,'2026'!$A$16:$G$161,2,FALSE)","v":{"$error":"#N/A"}},{"$f":"IF(ISBLANK(E717),\"hie eu nix drischribu\",VLOOKUP(E717,'2026'!$A$16:$G$161,3,FALSE))","v":"hie eu nix drischribu"}]
[null,{"$f":"IF(ISBLANK(D718),\"Alain, nix drischribu\",VLOOKUP(D718,'2026'!$A$16:$G$161,3,FALSE))","v":"Alain, nix drischribu"},{"$f":"VLOOKUP(D718,'2026'!$A$16:$B$161,2,FALSE)","v":{"$error":"#N/A"}},null,null,{"$f":"VLOOKUP(E718,'2026'!$A$16:$G$161,2,FALSE)","v":{"$error":"#N/A"}},{"$f":"IF(ISBLANK(E718),\"hie eu nix drischribu\",VLOOKUP(E718,'2026'!$A$16:$G$161,3,FALSE))","v":"hie eu nix drischribu"}]
[null,{"$f":"IF(ISBLANK(D719),\"Alain, nix drischribu\",VLOOKUP(D719,'2026'!$A$16:$G$161,3,FALSE))","v":"Alain, nix drischribu"},{"$f":"VLOOKUP(D719,'2026'!$A$16:$B$161,2,FALSE)","v":{"$error":"#N/A"}},null,null,{"$f":"VLOOKUP(E719,'2026'!$A$16:$G$161,2,FALSE)","v":{"$error":"#N/A"}},{"$f":"IF(ISBLANK(E719),\"hie eu nix drischribu\",VLOOKUP(E719,'2026'!$A$16:$G$161,3,FALSE))","v":"hie eu nix drischribu"}]
[null,{"$f":"IF(ISBLANK(D720),\"Alain, nix drischribu\",VLOOKUP(D720,'2026'!$A$16:$G$161,3,FALSE))","v":"Alain, nix drischribu"},{"$f":"VLOOKUP(D720,'2026'!$A$16:$B$161,2,FALSE)","v":{"$error":"#N/A"}},null,null,{"$f":"VLOOKUP(E720,'2026'!$A$16:$G$161,2,FALSE)","v":{"$error":"#N/A"}},{"$f":"IF(ISBLANK(E720),\"hie eu nix drischribu\",VLOOKUP(E720,'2026'!$A$16:$G$161,3,FALSE))","v":"hie eu nix drischribu"}]
[null,{"$f":"IF(ISBLANK(D721),\"Alain, nix drischribu\",VLOOKUP(D721,'2026'!$A$16:$G$161,3,FALSE))","v":"Alain, nix drischribu"},{"$f":"VLOOKUP(D721,'2026'!$A$16:$B$161,2,FALSE)","v":{"$error":"#N/A"}},null,null,{"$f":"VLOOKUP(E721,'2026'!$A$16:$G$161,2,FALSE)","v":{"$error":"#N/A"}},{"$f":"IF(ISBLANK(E721),\"hie eu nix drischribu\",VLOOKUP(E721,'2026'!$A$16:$G$161,3,FALSE))","v":"hie eu nix drischribu"}]
[null,{"$f":"IF(ISBLANK(D722),\"Alain, nix drischribu\",VLOOKUP(D722,'2026'!$A$16:$G$161,3,FALSE))","v":"Alain, nix drischribu"},{"$f":"VLOOKUP(D722,'2026'!$A$16:$B$161,2,FALSE)","v":{"$error":"#N/A"}},null,null,{"$f":"VLOOKUP(E722,'2026'!$A$16:$G$161,2,FALSE)","v":{"$error":"#N/A"}},{"$f":"IF(ISBLANK(E722),\"hie eu nix drischribu\",VLOOKUP(E722,'2026'!$A$16:$G$161,3,FALSE))","v":"hie eu nix drischribu"}]
[null,{"$f":"IF(ISBLANK(D723),\"Alain, nix drischribu\",VLOOKUP(D723,'2026'!$A$16:$G$161,3,FALSE))","v":"Alain, nix drischribu"},{"$f":"VLOOKUP(D723,'2026'!$A$16:$B$161,2,FALSE)","v":{"$error":"#N/A"}},null,null,{"$f":"VLOOKUP(E723,'2026'!$A$16:$G$161,2,FALSE)","v":{"$error":"#N/A"}},{"$f":"IF(ISBLANK(E723),\"hie eu nix drischribu\",VLOOKUP(E723,'2026'!$A$16:$G$161,3,FALSE))","v":"hie eu nix drischribu"}]
[null,{"$f":"IF(ISBLANK(D724),\"Alain, nix drischribu\",VLOOKUP(D724,'2026'!$A$16:$G$161,3,FALSE))","v":"Alain, nix drischribu"},{"$f":"VLOOKUP(D724,'2026'!$A$16:$B$161,2,FALSE)","v":{"$error":"#N/A"}},null,null,{"$f":"VLOOKUP(E724,'2026'!$A$16:$G$161,2,FALSE)","v":{"$error":"#N/A"}},{"$f":"IF(ISBLANK(E724),\"hie eu nix drischribu\",VLOOKUP(E724,'2026'!$A$16:$G$161,3,FALSE))","v":"hie eu nix drischribu"}]
[null,{"$f":"IF(ISBLANK(D725),\"Alain, nix drischribu\",VLOOKUP(D725,'2026'!$A$16:$G$161,3,FALSE))","v":"Alain, nix drischribu"},{"$f":"VLOOKUP(D725,'2026'!$A$16:$B$161,2,FALSE)","v":{"$error":"#N/A"}},null,null,{"$f":"VLOOKUP(E725,'2026'!$A$16:$G$161,2,FALSE)","v":{"$error":"#N/A"}},{"$f":"IF(ISBLANK(E725),\"hie eu nix drischribu\",VLOOKUP(E725,'2026'!$A$16:$G$161,3,FALSE))","v":"hie eu nix drischribu"}]
[null,{"$f":"IF(ISBLANK(D726),\"Alain, nix drischribu\",VLOOKUP(D726,'2026'!$A$16:$G$161,3,FALSE))","v":"Alain, nix drischribu"},{"$f":"VLOOKUP(D726,'2026'!$A$16:$B$161,2,FALSE)","v":{"$error":"#N/A"}},null,null,{"$f":"VLOOKUP(E726,'2026'!$A$16:$G$161,2,FALSE)","v":{"$error":"#N/A"}},{"$f":"IF(ISBLANK(E726),\"hie eu nix drischribu\",VLOOKUP(E726,'2026'!$A$16:$G$161,3,FALSE))","v":"hie eu nix drischribu"}]
[null,{"$f":"IF(ISBLANK(D727),\"Alain, nix drischribu\",VLOOKUP(D727,'2026'!$A$16:$G$161,3,FALSE))","v":"Alain, nix drischribu"},{"$f":"VLOOKUP(D727,'2026'!$A$16:$B$161,2,FALSE)","v":{"$error":"#N/A"}},null,null,{"$f":"VLOOKUP(E727,'2026'!$A$16:$G$161,2,FALSE)","v":{"$error":"#N/A"}},{"$f":"IF(ISBLANK(E727),\"hie eu nix drischribu\",VLOOKUP(E727,'2026'!$A$16:$G$161,3,FALSE))","v":"hie eu nix drischribu"}]

{"sheet":"2026","index":1,"n_rows":145,"n_cols":12,"rows_kept":145,"cut":false,"hidden":false,"merged":[[130,9,131,9],[132,0,133,0],[132,1,133,1],[132,2,133,2],[132,3,133,3],[132,4,133,4],[132,5,133,5],[132,6,133,6],[136,7,137,7],[136,8,137,8],[136,9,137,9],[132,7,133,7],[132,8,133,8],[132,9,133,9],[136,0,137,0],[136,1,137,1],[136,2,137,2],[136,3,137,3],[136,4,137,4],[136,5,137,5],[136,6,137,6],[130,0,131,0],[130,1,131,1],[130,2,131,2],[130,3,131,3],[130,4,131,4],[130,5,131,5],[130,6,131,6],[130,7,131,7],[130,8,131,8],[126,9,127,9],[128,0,129,0],[128,1,129,1],[128,2,129,2],[128,3,129,3],[128,4,129,4],[128,5,129,5],[128,6,129,6],[128,7,129,7],[128,8,129,8],[128,9,129,9],[126,0,127,0],[126,1,127,1],[126,2,127,2],[126,3,127,3],[126,4,127,4],[126,5,127,5],[126,6,127,6],[126,7,127,7],[126,8,127,8],[119,9,121,9],[122,0,125,0],[122,1,125,1],[122,2,125,2],[122,3,125,3],[122,4,125,4],[122,5,125,5],[122,6,125,6],[122,7,125,7],[122,8,125,8],[122,9,125,9],[119,0,121,0],[119,1,121,1],[119,2,121,2],[119,3,121,3],[119,4,121,4],[119,5,121,5],[119,6,121,6],[119,7,121,7],[119,8,121,8],[112,0,118,0],[112,1,118,1],[112,2,118,2],[112,3,118,3],[112,5,118,5],[112,6,118,6],[112,7,118,7],[112,8,118,8],[112,9,118,9],[100,9,101,9],[108,0,109,0],[108,1,109,1],[108,2,109,2],[108,3,109,3],[108,4,109,4],[108,5,109,5],[108,6,109,6],[108,7,109,7],[108,8,109,8],[108,9,109,9],[100,0,101,0],[100,1,101,1],[100,2,101,2],[100,3,101,3],[100,4,101,4],[100,5,101,5],[100,6,101,6],[100,7,101,7],[100,8,101,8],[94,9,95,9],[98,0,99,0],[98,1,99,1],[98,2,99,2],[98,3,99,3],[98,4,99,4],[98,5,99,5],[98,6,99,6],[98,7,99,7],[98,8,99,8],[98,9,99,9],[94,0,95,0],[94,1,95,1],[94,2,95,2],[94,3,95,3],[94,4,95,4],[94,5,95,5],[94,6,95,6],[94,7,95,7],[94,8,95,8],[88,9,89,9],[90,0,93,0],[90,1,93,1],[90,2,93,2],[90,3,93,3],[90,4,93,4],[90,5,93,5],[90,6,93,6],[90,7,93,7],[90,8,93,8],[90,9,93,9],[88,0,89,0],[88,1,89,1],[88,2,89,2],[88,3,89,3],[88,4,89,4],[88,5,89,5],[88,6,89,6],[88,7,89,7],[88,8,89,8],[75,9,76,9],[77,0,78,0],[77,1,78,1],[77,2,78,2],[77,3,78,3],[77,4,78,4],[77,5,78,5],[77,6,78,6],[77,7,78,7],[77,8,78,8],[77,9,78,9],[75,0,76,0],[75,1,76,1],[75,2,76,2],[75,3,76,3],[75,4,76,4],[75,5,76,5],[75,6,76,6],[75,7,76,7],[75,8,76,8],[67,9,68,9],[69,0,71,0],[69,1,71,1],[69,2,71,2],[69,3,71,3],[69,4,71,4],[69,5,71,5],[69,6,71,6],[69,7,71,7],[69,8,71,8],[69,9,71,9],[67,0,68,0],[67,1,68,1],[67,2,68,2],[67,3,68,3],[67,4,68,4],[67,5,68,5],[67,6,68,6],[67,7,68,7],[67,8,68,8],[38,9,39,9],[38,10,39,10],[40,0,41,0],[40,1,41,1],[40,2,41,2],[40,3,41,3],[40,4,41,4],[40,5,41,5],[40,6,41,6],[40,7,41,7],[40,8,41,8],[40,9,41,9],[40,10,41,10],[38,0,39,0],[38,1,39,1],[38,2,39,2],[38,3,39,3],[38,4,39,4],[38,5,39,5],[38,6,39,6],[38,7,39,7],[38,8,39,8],[0,0,0,11],[2,0,2,11],[25,0,26,0],[25,1,26,1],[25,2,26,2],[25,3,26,3],[25,4,26,4],[25,5,26,5],[25,6,26,6],[25,7,26,7],[25,8,26,8],[25,9,26,9]]}
["ALPE ROTIGEN TURTMANNTAL"]
[]
["Alpaufzug vom 13. Juni 2026"]
[]
[null,null,"Trupposiegerin",93,null,null,"Tiere",null,null,"2025 klassiert und nicht da"]
[]
[null,null,"Klassiert 2025",21,null,"IV","Erstmelken",null,null,"Cashida Bregy Ralf & Adolf (8.)"]
[null,null,null,null,null,null,null,null,null,"Champion Bregy Ralf & Adolf (10.)"]
[null,null,"Königin 2025",18,null,"II","Zweitmelken",null,null,"Canabis Bregy Ralf & Adolf (10.)"]
[null,null,null,null,null,null,null,null,null,"Lorens Gebrüder Jäger (12.)"]
[null,null,null,36,null,"N","Neu (2025 nicht da)",null,null,"Diabolo Bregy Anja (13.)"]
[]
[null,null,null,42,null,null,"Glocken an Ringkuhkämpfen"]
[]
[null,null,null,32,null,null,"Klassierte Tiere an Ringkuhkämpfen"]
[]
["Nr.","Name","Besitzer","Ort",null,null,"Geb.","BDTA","Mutter","Vater","Klassierungen Alpe","Klassierungen Match"]
[1,"Vaya","Bayard Jan","N'Gampel",null,null,"2020-09-19","120.1393.5206.0","Varia","Chorizo","7. V Biffiga 23"]
[2,"Mamba","Bayard Medard & Gustav","N'Gampel",null,null,"2018-10-27","120.1449.8998.5","Malice","#Vilar","Königin IV Rot. 22 (Brändji)","2. IV Goler 22"]
[3,"Pegasus","Bayard Medard & Gustav","N'Gampel",null,"II","2021-11-11","120.1671.1416.6","Pandera","Attila",null,"7. Zweitm. Vifra 26"]
[4,"Vampir","Bayard Medard & Gustav","N'Gampel",null,null,"2015-10-22","120.0618.4536.4","Violette","@Melchior"]
[5,"Valerie","Bayard Medard & Gustav","N'Gampel",null,null,"2019-10-27","120.1474.9046.4","Vampir","@Tiburon","3. IV Rotigen 22 (Brändji)","5. IV Goler 23"]
[6,"Cataille","Bregy Alain","Ergisch","N",null,"2018-12-25","120.1461.2271.7","Catalina","@Pagnol",null,"6. Zweitm. Vifra 23"]
[7,"Bilbao","Bregy Alain","Ergisch","N",null,"2018-12-09","120.1410.3823.5","Bobard","@Matandou"]
[8,"Valesia","Bregy Alain","Ergisch","N",null,"2019-11-10","120.1393.5185.8","Vanessa","Northon"]
[9,"Banja","Bregy Alain","Ergisch","N",null,"2020-10-22","120.1596.3737.6","Bora","#Merlin",null,"7. II Martigny 26"]
[null,null,null,null,null,null,null,null,null,null,null,"4. V Aproz 23"]
[10,"Perona","Bregy Uli, Lisi & Pascal","Ergisch",null,null,"2018-10-12","120.1394.8450.1","Pandora","Bandito",null,"4. IV Goler 22"]
[11,"Tirana","Bregy Uli, Lisi & Pascal","Ergisch",null,null,"2019-11-30","120.1531.4905.9","Tiranie","$Neron",null,"2. III Goler 25"]
[12,"Cara","Bregy Uli, Lisi & Pascal","Ergisch",null,"II","2021-10-22","120.1664.8612.7","Catalina","#Merlin"]
[13,"Cora","Bregy Uli, Lisi & Pascal","Ergisch",null,"II","2021-10-22","120.1664.8613.4","Catalina","#Merlin"]
[14,"Samba","Bregy Uli, Lisi & Pascal","Ergisch",null,"II","2021-10-31","120.1664.8614.1","Simba","#Xio"]
[15,"Souma","Bregy Uli, Lisi & Pascal","Ergisch","N","IV","2022-10-06","120.1731.9444.2","Souki","@Pirlo"]
[16,"Belle","Bregy Uli, Lisi & Pascal","Ergisch","N","IV","2022-10-08","120.1731.9449.7","Bora","@Racket"]
[17,"Panja","Bregy Uli, Lisi & Pascal","Ergisch","N","IV","2022-11-03","120.1731.9447.3","Perona","#Tirano"]
[18,"Calina","Bregy Uli, Lisi & Pascal","Ergisch","N","IV","2022-11-17","120.1731.9454.1","Caline","$Neron"]
[19,"Colette","Familie Leiggener","Turtmann",null,null,"2018-11-23","120.1467.1536.0","Clochette","$Bello",null,"3. II Goler 24"]
[20,"Tirana","Familie Leiggener","Turtmann",null,null,"2019-11-22","120.1537.2531.4","Tigres","Pandor"]
[21,"Royale","Familie Leiggener","Turtmann",null,null,"2019-12-01","120.1537.2532.1","Rebelle","$Breona",null,"5. Espace Mont B. 23"]
[null,null,null,null,null,null,null,null,null,null,null,"Königin V Vifra 22"]
[22,"Tyson","Familie Leiggener","Turtmann",null,null,"2020-10-30","120.1537.2537.6","Tigres","$Breona",null,"4. V Kantonal 23"]
[null,null,null,null,null,null,null,null,null,null,null,"Königin V Vifra 23"]
[23,"Soraya","Gebrüder Jäger","Turtmann",null,null,"2019-09-28","120.1485.8532.9","Sultane","@Rebel"]
[24,"Tamara","Gebrüder Jäger","Turtmann",null,null,"2020-10-26","120.1485.8545.9","Tiara","#Sultano","4. V Rotigen 23"]
[25,"Tirana","Gebrüder Jäger","Turtmann",null,null,"2020-11-09","120.1485.8546.6","Tanja","@Sultano",null,"4. IV Goler 24"]
[26,"Betty Boop","Gebrüder Jäger","Turtmann","N","II","2021-10-11","120.1672.6436.6","Batischa","Soprano"]
[27,"Silene","Gebrüder Jäger","Turtmann",null,"II","2021-12-07","120.1667.7566.5","Sultane","#Biloude"]
[28,"Luna","Gebrüder Jäger","Turtmann","N","IV","2022-09-22","120.1469.3342.9","Lorens","#Fusionnel"]
[29,"Tequila","Gebrüder Jäger","Turtmann","N","IV","2022-10-04","120.1667.7570.2","Tabea","#Ringo"]
[30,"Tamango","Gebrüder Jäger","Turtmann","N","IV","2022-12-22","120.1667.7579.5","Tara","#Ringo"]
[31,"Santana","Gebrüder Jäger","Turtmann","N","IV","2023-01-23","120.1667.7580.1","Shanaya","#Allalin"]
[32,"Ceres","Geschwister Lötscher","Agarn","N",null,"2016-09-30","120.0875.9799.5","Ceres","@Fangio"]
[33,"Pouki","Lötscher Sandrine & Cédric","Oberems","N",null,"2018-10-04","120.0875.9813.8","Putschi","@Perle"]
[34,"Mesquine","Lötscher Sandrine & Cédric","Oberems","N",null,"2018-12-21","120.1420.4498.3","Micabol","@Bobino"]
[35,"Cartouche","Geschwister Lötscher","Agarn","N",null,"2019-11-15","120.1468.7073.1","Coquette","@Crapule"]
[36,"Perle","Lötscher Sandrine & Cédric","Oberems","N",null,"2020-12-24","120.1468.6923.0","Colombo","@Batchi"]
[37,"Cobra","Geschwister Lötscher","Agarn","N","II","2021-10-19","120.1651.3337.4","Cobra","@Picador"]
[38,"Casimir","Geschwister Lötscher","Agarn","N","II","2022-01-10","120.1651.3340.4","Canelle","@Picador"]
[39,"Chips","Geschwister Lötscher","Agarn","N","IV","2022-11-27","120.1709.6112.2","Ceres","@Charly"]
[40,"Pandora","Lötscher Sandrine & Cédric","Oberems","N","IV","2022-11-28","120.1651.3342.8","Pouki","Rocky"]
[41,"Coquine","Geschwister Lötscher","Agarn","N","IV","2023-03-05","120.1709.6120.7","Coquine","#Bill"]
[42,"Alena","Hischier H. & Bühlmann J.","Oberems",null,null,"2018-12-06","120.0674.5756.1","Adonis","@Pagnol"]
[43,"Baghira","Hischier H. & Bühlmann J.","Oberems",null,null,"2018-12-11","120.1404.2739.9","Jamanda","@Pagnol"]
[44,"Tara","Hischier H. & Bühlmann J.","Oberems",null,null,"2020-11-04","120.1545.6587.2","Jamanda","@Fangio"]
[45,"Cayenne","Hischier H. & Bühlmann J.","Oberems",null,"II","2021-09-27","120.1662.7806.7","Calmy","Tigrou"]
[46,"Cherico","Lauber Noah & Jonas","Agarn",null,null,"2020-12-29","120.1541.8050.1","Cobra","@Pagnol"]
[47,"Ramona","Lauber Noah & Jonas","Agarn",null,"II","2022-01-09","120.1685.7844.8","Tonner","@Charly"]
[48,"Metis","Stallung Jäger & Tscherrig","Turtmann",null,null,"2016-11-29","120.1335.1505.8","Mitis","#Prince","9. Rotigen 25","6. III Goler 23"]
[null,null,null,null,null,null,null,null,null,null,null,"Königin II Aproz 23"]
[49,"Samba","Stallung Jäger & Tscherrig","Turtmann",null,null,"2017-10-19","120.1335.1511.9","Sera","@Bocassa","10. Rotigen 25"]
[null,null,null,null,null,null,null,null,null,null,"11. Rotigen 24"]
[null,null,null,null,null,null,null,null,null,null,"2. Zweitm. Rotigen 22"]
[50,"Beline","Stallung Jäger & Tscherrig","Turtmann","N",null,"2018-10-30","120.1416.5725.2","Bataille","Bogosse",null,"7. IV Goler 22"]
[51,"Bijou","Stallung Jäger & Tscherrig","Turtmann",null,null,"2018-12-17","120.1416.5733.7","Bandit","Bogosse"]
[52,"Santana","Stallung Jäger & Tscherrig","Turtmann",null,null,"2019-12-14","120.1541.4712.2","Sera","#Prince"," ","3. I Goler 25"]
[53,"Sina","Stallung Jäger & Tscherrig","Turtmann",null,null,"2020-10-29","120.1541.4719.1","Sera","Phalanx","3. Zweitm. Rotigen 25"]
[null,null,null,null,null,null,null,null,null,null,"2. V Rotigen 23"]
[54,"Pinga","Stallung Jäger & Tscherrig","Turtmann",null,null,"2020-11-01","120.1541.4724.5","Pivoine","Nitro","2. Zweitm. Rotigen 25"]
[null,null,null,null,null,null,null,null,null,null,"4. V Rotigen 23"]
[55,"Myla","Stallung Jäger & Tscherrig","Turtmann","N","II","2021-09-19","120.1541.4728.3","Mygale","#Livio",null,"5. Zweitm. Vifra 26"]
[56,"Fanny","Stallung Jäger & Tscherrig","Turtmann",null,"II","2021-09-27","120.1541.4730.6","Flora","#Livio","2. V Rotigen 24","7. V Vifra 24"]
[57,"Bogota","Stallung Jäger & Tscherrig","Turtmann",null,"II","2021-09-30","120.1541.4732.0","Beline","#Livio"]
[58,"Pixel","Stallung Jäger & Tscherrig","Turtmann","N","II","2021-10-18","120.1541.4735.1","Pivoine","#Livio","5. V Rotigen 24","3. V Goler 24"]
[59,"Medusa","Stallung Jäger & Tscherrig","Turtmann",null,"II","2021-11-29","120.1664.2443.3","Metis","#Livio",null,"2. V Vifra 24"]
[60,"Samoa","Stallung Jäger & Tscherrig","Turtmann","N","IV","2022-10-07","120.1694.9207.1","Sera","#Bruce-Lee",null,"7. V Goler 25"]
[61,"Puma","Stallung Jäger & Tscherrig","Turtmann","N","IV","2022-10-12","120.1694.9211.8","Prunelle","#Balu"]
[62,"Xenia","Stallung Mussmann","Steg",null,null,"2020-10-13","120.1529.2011.6","Xijlana","Rocky"]
[63,"Mistral","Stallung Mussmann","Steg","N","IV","2022-10-08","120.1694.9208.8","Mygale","#Balu"]
[64,"Bonita","Stallung Passeraub","Getwing",null,null,"2014-01-08","120.1118.4001.1","Bombache","Mali","13. Rotigen 25"]
[null,null,null,null,null,null,null,null,null,null,"8. Rotigen 24"]
[65,"Belana","Stallung Passeraub","Getwing",null,null,"2018-10-10","120.1405.6860.3","Baghera","#Fedulov","9. Rotigen 25"]
[null,null,null,null,null,null,null,null,null,null,"Königin Zweitm. Rotigen 23"]
[null,null,null,null,null,null,null,null,null,null,"2. IV Rotigen 22 (Gr. Kühe)"]
[null,null,null,null,null,null,null,null,null,null,"Königin V Rotigen 21"]
[66,"Beluga","Stallung Passeraub","Getwing",null,null,"2018-10-10","120.1405.6861.0","Baghera","#Fedulov","14. Rotigen 25"]
[null,null,null,null,null,null,null,null,null,null,"2. V Rotigen 21"]
[67,"Boriana","Stallung Passeraub","Getwing",null,null,"2018-10-19","120.1405.6865.8","Bonita","#Fedulov",null,"5. II Goler 26"]
[68,"Bolienne","Stallung Passeraub","Getwing",null,null,"2019-11-28","120.1526.1438.1","Baghera","#Corbi"]
[69,"Bandera","Stallung Passeraub","Getwing",null,null,"2019-12-23","120.1546.4961.9","Ballerine","#Calimero",null,"5. I Goler 26"]
[null,null,null,null,null,null,null,null,null,null,null,"6. IV Goler 23"]
[70,"Belle","Stallung Passeraub","Getwing",null,"II","2021-10-06","120.1608.8154.6","Belana","$Coison","3. IV Rotigen 25"]
[null,null,null,null,null,"IV",null,null,null,null,"5. V Rotigen 24"]
[71,"Fiona","Hutter Richard","Lalden",null,"II","2021-11-03","120.1677.0277.6","Fagar","#Lotus","2. V Rotigen 25"]
[72,"Poseidon","Hutter Richard","Lalden","N","IV","2022-09-26","120.1736.7978.9","Princesse","#Benedicto"]
[73,"Malice","Stallung Passeraub","Getwing","N","IV","2022-10-16","120.1729.0840.8","Menace","#Brando","Königin V Rotigen 25"]
[74,"Brunette","Stallung Passeraub","Getwing","N","IV","2022-10-24","120.1736.7985.7","Beres","@Bascule",null,"2. V Vifra 25"]
[75,"Baldrun","Stallung Passeraub","Getwing","N","IV","2022-10-31","120.1736.7986.4","Bandera","$Bykov",null,"4. IV Vifra 26"]
[76,"Venus","Williner Anton","Visp",null,null,"2019-11-08","120.1393.5182.7","Vanda","Northon","2. IV Rotigen 23 (Brändji)","6. IV Aproz 23"]
[77,"Tirana","Williner Anton","Visp",null,null,"2019-12-30","120.1393.5198.8","Tira","Vitello","Königin IV Rot. 23 (Brändji)","3. IV Vifra 23"]
[null,null,null,null,null,null,null,null,null,null,"3. V Biffiga 22"]
[78,"Timba","Williner Anton","Visp",null,null,"2020-10-29","120.1393.5219.0","Trix","Chorizo"]
[79,"Dorin","Williner Anton","Visp",null,null,"2020-10-31","120.1393.5220.6","Diva","Vitello"]
[80,"Xena","Zumofen / Gattlen","Turtmann",null,null,"2012-10-13","120.1051.2928.3","Xenti","@Caribou","Königin Rotigen 25"]
[null,null,null,null,null,null,null,null,null,null,"3. Rotigen 24"]
[null,null,null,null,null,null,null,null,null,null,"Königin Rotigen 23"]
[null,null,null,null,null,null,null,null,null,null,"Königin Rotigen 22"]
[null,null,null,null,null,null,null,null,null,null,"3. Rotigen 21"]
[null,null,null,null,null,null,null,null,null,null,"2. Rotigen 20"]
[null,null,null,null,null,null,null,null,null,null,"3. Rotigen 19"]
[81,"Souris","Zumofen / Gattlen","Turtmann",null,null,"2015-10-10","120.1196.8739.7","Souris","#Capo","8. Rotigen 25","6. II Chermignon 25"]
[null,null,null,null,null,null,null,null,null,null,null,"Königin I Fully 23"]
[null,null,null,null,null,null,null,null,null,null,null,"6. IV Goler 19"]
[82,"Rena","Zumofen / Gattlen","Turtmann",null,null,"2016-01-30","120.1269.9552.2","Ruby","@Caribou","6. Rotigen 25","5. I Goler 23"]
[null,null,null,null,null,null,null,null,null,null,"11. Rotigen 24"]
[null,null,null,null,null,null,null,null,null,null,"11. Rotigen 23"]
[null,null,null,null,null,null,null,null,null,null,"14. Rotigen 22"]
[83,"Rigolo","Zumofen / Gattlen","Turtmann",null,null,"2016-10-08","120.1269.9554.6","Rocky","$Breona","4. Rotigen 24","4. II Aproz 23"]
[null,null,null,null,null,null,null,null,null,null,"14. Rotigen 23"]
[84,"Vesuv","Zumofen / Gattlen","Turtmann",null,null,"2016-11-11","120.1269.9558.4","Volero","#Torro","5. Rotigen 25","3. II Chermignon 25"]
[null,null,null,null,null,null,null,null,null,null,"14. Rotigen 23","2. III Goler 23"]
[85,"Xea","Zumofen / Gattlen","Turtmann",null,null,"2018-11-20","120.1402.0674.1","Xena","#Concorde",null,"2. I Goler 25"]
[null,null,null,null,null,null,null,null,null,null,null,"5. IV Vifra 22"]
[86,"Roquette","Zumofen / Gattlen","Turtmann",null,null,"2019-11-08","120.1524.2753.0","Rocky","@Pagnol","4. Rotigen 25"]
[null,null,null,null,null,null,null,null,null,null,"Königin Zweitm. Rotigen 24"]
[87,"Fame","Zumofen / Gattlen","Turtmann",null,null,"2020-10-25","120.1609.2577.6","Fayola","Felix"]
[88,"Valdeeze","Zumofen / Gattlen","Turtmann",null,null,"2020-11-02","120.1609.2579.0","Violette","Felix"]
[89,"Verygood","Zumofen / Gattlen","Turtmann",null,null,"2020-11-20","120.1609.2582.0","Vanda","Felix",null,"7. Kantonal IV 24"]
[null,null,null,null,null,null,null,null,null,null,null,"5. IV Goler 24"]
[90,"Calcuta","Zumofen / Gattlen","Turtmann",null,"II","2021-10-20","120.1673.3925.5","Calcuta","#Vilar"]
[91,"Vergara","Zumofen / Gattlen","Turtmann","N","IV","2022-10-02","120.1673.3931.6","Vavas","#Carlos"]
[92,"Roseau","Zumofen / Gattlen","Turtmann","N","IV","2022-10-11","120.1673.3933.0","Rena","#Carlos",null,"5. IV Goler 26"]
[93,"Farinelle","Zumofen / Gattlen","Turtmann","N","IV","2022-11-06","120.1673.3939.2","Falk","#Carlos"]
[]
["Viel Vergnügen und spannende Kämpfe wünscht die Alpgenossenschaft Turtmanntal und die Bestosser der Alpe Rotigen"]
[null,null,null,null,null,null,null,null,null,null,null,"© Alpe Rotigen"]

{"sheet":"2025","index":2,"n_rows":164,"n_cols":12,"rows_kept":164,"cut":false,"hidden":false,"merged":[[27,9,31,9],[32,6,34,6],[32,7,34,7],[32,8,34,8],[32,9,34,9],[0,0,0,11],[2,0,2,11],[24,0,25,0],[24,1,25,1],[24,2,25,2],[24,3,25,3],[24,4,25,4],[24,5,25,5],[24,6,25,6],[24,7,25,7],[24,8,25,8],[24,9,25,9],[32,0,34,0],[32,1,34,1],[32,2,34,2],[32,3,34,3],[32,4,34,4],[32,5,34,5],[27,0,31,0],[27,1,31,1],[27,2,31,2],[27,3,31,3],[35,6,37,6],[35,7,37,7],[35,8,37,8],[27,6,31,6],[27,7,31,7],[27,8,31,8],[64,5,65,5],[69,0,70,0],[69,1,70,1],[69,2,70,2],[69,3,70,3],[69,4,70,4],[69,5,70,5],[35,9,37,9],[39,0,41,0],[39,1,41,1],[39,2,41,2],[39,3,41,3],[39,4,41,4],[39,5,41,5],[35,0,37,0],[35,1,37,1],[35,2,37,2],[35,3,37,3],[35,4,37,4],[35,5,37,5],[39,6,41,6],[39,7,41,7],[39,8,41,8],[39,9,41,9],[78,0,82,0],[78,1,82,1],[78,2,82,2],[78,3,82,3],[78,4,82,4],[64,0,65,0],[64,1,65,1],[64,2,65,2],[64,3,65,3],[64,4,65,4],[66,5,67,5],[66,6,67,6],[66,7,67,7],[66,8,67,8],[66,9,67,9],[69,6,70,6],[69,7,70,7],[69,8,70,8],[69,9,70,9],[98,7,99,7],[98,8,99,8],[83,0,85,0],[83,1,85,1],[83,2,85,2],[83,3,85,3],[83,4,85,4],[66,10,67,10],[64,6,65,6],[64,7,65,7],[64,8,65,8],[64,9,65,9],[64,10,65,10],[69,10,70,10],[78,5,82,5],[78,6,82,6],[78,7,82,7],[78,8,82,8],[78,9,82,9],[66,0,67,0],[66,1,67,1],[66,2,67,2],[66,3,67,3],[66,4,67,4],[100,0,101,0],[100,1,101,1],[100,2,101,2],[100,3,101,3],[100,4,101,4],[100,5,101,5],[98,9,99,9],[98,10,99,10],[83,5,85,5],[83,6,85,6],[83,7,85,7],[83,8,85,8],[83,9,85,9],[100,6,101,6],[100,7,101,7],[100,8,101,8],[100,9,101,9],[98,0,99,0],[98,1,99,1],[98,2,99,2],[98,3,99,3],[98,4,99,4],[98,5,99,5],[98,6,99,6],[102,6,103,6],[102,7,103,7],[102,8,103,8],[102,9,103,9],[117,0,119,0],[117,1,119,1],[117,2,119,2],[117,3,119,3],[117,4,119,4],[117,5,119,5],[117,6,119,6],[117,7,119,7],[117,8,119,8],[117,9,119,9],[102,0,103,0],[102,1,103,1],[102,2,103,2],[102,3,103,3],[102,4,103,4],[102,5,103,5],[132,9,133,9],[134,0,139,0],[134,1,139,1],[134,2,139,2],[134,3,139,3],[134,4,139,4],[134,5,139,5],[134,6,139,6],[134,7,139,7],[134,8,139,8],[134,9,139,9],[132,0,133,0],[132,1,133,1],[132,2,133,2],[132,3,133,3],[132,4,133,4],[132,5,133,5],[132,6,133,6],[132,7,133,7],[132,8,133,8],[140,9,142,9],[143,0,144,0],[143,1,144,1],[143,2,144,2],[143,3,144,3],[143,4,144,4],[143,5,144,5],[143,6,144,6],[143,7,144,7],[143,8,144,8],[143,9,144,9],[140,0,142,0],[140,1,142,1],[140,2,142,2],[140,3,142,3],[140,4,142,4],[140,5,142,5],[140,6,142,6],[140,7,142,7],[140,8,142,8],[145,9,147,9],[148,0,149,0],[148,1,149,1],[148,2,149,2],[148,3,149,3],[148,4,149,4],[148,5,149,5],[148,6,149,6],[148,7,149,7],[148,8,149,8],[148,9,149,9],[145,0,147,0],[145,1,147,1],[145,2,147,2],[145,3,147,3],[145,4,147,4],[145,5,147,5],[145,6,147,6],[145,7,147,7],[145,8,147,8],[155,9,156,9],[150,6,151,6],[150,7,151,7],[150,8,151,8],[150,9,151,9],[155,0,156,0],[155,1,156,1],[155,2,156,2],[155,3,156,3],[155,4,156,4],[155,5,156,5],[150,0,151,0],[150,1,151,1],[150,2,151,2],[150,3,151,3],[150,4,151,4],[150,5,151,5],[155,6,156,6],[155,7,156,7],[155,8,156,8]]}
["ALPE ROTIGEN TURTMANNTAL"]
[]
["Alpaufzug vom 14. Juni 2025"]
[]
[null,null,"Trupposiegerin",105,null,null,"Tiere",null,null,"2024 klassiert und nicht da"]
[]
[null,null,"Klassiert 2024",29,null,"IV","Erstmelken",null,null,"Ballerine Stallung Passeraub (6.)"]
[null,null,null,null,null,null,null,null,null,"Violette Zumofen / Gattlen (8.)"]
[null,null,"Königin 2024",19,null,"II","Zweitmelken",null,null,"Coquette Bregy Ralf & Adolf (10.)"]
[null,null,null,null,null,null,null,null,null,"Sera Stallung Jäger & Tscherrig (12.)"]
[null,null,null,42,null,"N","Neu (2024 nicht da)"]
[]
[null,null,null,54,null,null,"Glocken an Ringkuhkämpfen"]
[]
[null,null,null,37,null,null,"Klassierte Tiere an Ringkuhkämpfen"]
[]
["Nr.","Name","Besitzer","Ort",null,null,"Geb.","BDTA","Mutter","Vater","Klassierungen Alpe","Klassierungen Match"]
[1,"Vaya","Bayard Medard & Gustav","N'Gampel","N","II","2020-09-19","120.1393.5206.0","Varia","Chorizo","7. V Biffiga 23"]
[2,"Mamba","Bayard Medard & Gustav","N'Gampel",null,null,"2018-10-27","120.1449.8998.5","Malice","#Vilar","Königin IV Rot. 22 (Brändji)","2. IV Goler 22"]
[3,"Pegasus","Bayard Medard & Gustav","N'Gampel","N","IV","2021-11-11","120.1671.1416.6","Pandera","Attila"]
[4,"Vampir","Bayard Medard & Gustav","N'Gampel",null,null,"2015-10-22","120.0618.4536.4","Violette","@Melchior"]
[5,"Valerie","Bayard Medard & Gustav","N'Gampel",null,null,"2019-10-27","120.1474.9046.4","Vampir","@Tiburon","3. IV Rotigen 22 (Brändji)","5. IV Goler 23"]
[6,"Mascara","Bregy Silvan & Patrick","Unterems","N","IV","2021-09-30","120.1469.3331.3","Milow","#Primus"]
[7,"Champion ","Bregy Ralf & Adolf","Unterems",null,null,"2019-11-19","120.1469.3321.4","Coquette","#Dracula","2. V Zinal 22","6. I Goler 25"]
[8,"Celtis","Bregy Ralf & Adolf","Unterems",null,"II","2020-09-08","120.1469.3322.1","Celtic","@Cervin","3. IV Rotigen 24 (Gr. Kühe)","Königin V Aproz 23"]
[null,null,null,null,null,null,null,null,null,null,"2. V Zinal 23"]
[9,"Flaca","Bregy Ralf & Adolf","Unterems","N","IV","2021-10-14","120.1469.3334.4","Flacabre","#Camaro","2. V Zinal 24"]
[10,"Diabolo","Bregy Anja","Unterems",null,null,"2014-11-19","120.0708.9312.7","Creola","#Teiro","15. Rotigen 24","Königin I Goler 22"]
[null,null,null,null,null,null,null,null,null,null,"15. Rotigen 23","Königin Zweitm. Vifra 19"]
[null,null,null,null,null,null,null,null,null,null,"13. Rotigen 22","4. IV Martigny 18"]
[null,null,null,null,null,null,null,null,null,null,"13. Rotigen 21"]
[null,null,null,null,null,null,null,null,null,null,"15. Rotigen 20"]
[11,"Cashida","Bregy Ralf & Adolf","Unterems",null,null,"2016-09-11","120.1255.5038.8","Clairon","$Breona","7. Rotigen 24","7. II Aproz 22"]
[null,null,null,null,null,null,null,null,null,null,"9. Rotigen 23","2. V Goler 19"]
[null,null,null,null,null,null,null,null,null,null,"13. Rotigen 22"]
[12,"Mirage","Bregy Silvan & Patrick","Unterems",null,null,"2019-10-22","120.1469.3319.1","Milow","#Casino","2. Zweitm. Rotigen 24"]
[null,null,null,null,null,null,null,null,null,null,"Königin IV Rot. 22 (Gr. Kühe)"]
[null,null,null,null,null,null,null,null,null,null,"4. V Zinal 22"]
[13,"Copaine","Bregy Ralf & Adolf","Unterems","N","IV","2021-11-07","120.1469.3339.9","Coquette","#Cowboy","Königin V Zinal 24"]
[14,"Canabis","Bregy Ralf & Adolf","Unterems",null,null,"2015-11-11","120.1255.5036.4","Canaille","@Bison","10. Rotigen 24","2. I Aproz 22"]
[null,null,null,null,null,null,null,null,null,null,"9. Rotigen 23","2. IV Vifra 19"]
[null,null,null,null,null,null,null,null,null,null,"10. Rotigen 22"]
[15,"Damaris","Bregy Anja","Unterems",null,"II","2020-10-07","120.1469.3323.8","Diabolo","#Cresus","6. V Zinal 23","3. Zweitm. Vifra 25"]
[16,"Combat","Bregy Ralf & Adolf","Unterems",null,"II","2020-10-25","120.1469.3328.3","Coeur","@Caribou","4. V Zinal 23","Königin Zweitm. Vifra 25"]
[17,"Claris","Bregy Ralf & Adolf","Unterems",null,"II","2020-09-28","120.1469.3324.5","Cayenne","@Marquis","3. V Zinal 23"]
[18,"Samba","Bregy Uli, Lisi & Pascal","Ergisch","N","IV","2021-10-31","120.1664.8614.1","Simba","#Xio"]
[19,"Perona","Bregy Uli, Lisi & Pascal","Ergisch",null,null,"2018-10-12","120.1394.8450.1","Pandora","Bandito",null,"4. IV Goler 22"]
[20,"Tirana","Bregy Uli, Lisi & Pascal","Ergisch",null,null,"2019-11-30","120.1531.4905.9","Tiranie","$Neron",null,"2. III Goler 25"]
[21,"Calimero","Bregy Uli, Lisi & Pascal","Ergisch","N","IV","2021-11-20","120.1664.8616.5","Caline","#Venin"]
[22,"Cara","Bregy Uli, Lisi & Pascal","Ergisch","N","IV","2021-10-22","120.1664.8612.7","Catalina","#Merlin"]
[23,"Cora","Bregy Uli, Lisi & Pascal","Ergisch","N","IV","2021-10-22","120.1664.8613.4","Catalina","#Merlin"]
[24,"Tina","Bregy Uli, Lisi & Pascal","Ergisch","N","IV","2021-10-07","120.1596.3749.9","Tiranie","#Xio"]
[25,"Pandora","Bühlmann Bruno & Sandra","Burgistein","N",null,"2012-10-05","120.0922.0888.6","Panache","Toby"]
[26,"Lavinja","Bühlmann Bruno & Sandra","Burgistein",null,null,"2015-10-28","120.1113.9894.9","Lola ","#Filou"]
[27,"Toutex","Bühlmann Bruno & Sandra","Burgistein",null,null,"2017-10-02","120.1255.5046.3","Toupie","#Texas"]
[28,"Larissa","Bühlmann Bruno & Sandra","Burgistein",null,null,"2018-01-23","120.1258.3689.5","Ladina","@Fangio"]
[29,"Baghira","Bühlmann Bruno & Sandra","Burgistein","N",null,"2019-10-21","120.1460.7530.3","Baquera","@Clinton"]
[30,"Luise","Bühlmann Bruno & Sandra","Burgistein","N",null,"2019-10-31","120.1258.3698.7","Lola ","@Jenal"]
[31,"Viola","Bühlmann Bruno & Sandra","Burgistein","N",null,"2020-03-18","120.1258.3700.7","Valentina","Poltry"]
[32,"Laidy","Bühlmann Bruno & Sandra","Burgistein","N","II","2020-10-17","120:1523.9876.2","Lola ","@Primus"]
[33,"Toucolo","Bühlmann Bruno & Sandra","Burgistein","N","IV","2021-10-11","120.1469.3332.0","Toutex","$Colombo"]
[34,"Panda","Bühlmann Bruno & Sandra","Burgistein","N","IV","2021-10-15","120.1523.9885.4","Pandora","Varon"]
[35,"Colette","Familie Leiggener","Turtmann",null,null,"2018-11-23","120.1467.1536.0","Clochette","$Bello",null,"3. II Goler 24"]
[36,"Tirana","Familie Leiggener","Turtmann",null,null,"2019-11-22","120.1537.2531.4","Tigres","Pandor"]
[37,"Royale","Familie Leiggener","Turtmann",null,null,"2019-12-01","120.1537.2532.1","Rebelle","$Breona",null,"5. Espace Mont B. 23"]
[null,null,null,null,null,null,null,null,null,null,null,"Königin V Vifra 22"]
[38,"Tyson","Familie Leiggener","Turtmann",null,"II","2020-10-30","120.1537.2537.6","Tigres","$Breona",null,"4. V Kantonal 23"]
[null,null,null,null,null,null,null,null,null,null,null,"Königin V Vifra 23"]
[39,"Bolero","Familie Fux/Schaller","Eggerberg",null,null,"2013-11-11","120.1119.8616.0","Baguera","Tiger"]
[40,"Bacardi","Familie Fux/Schaller","Eggerberg",null,null,"2014-10-20","120.1186.6938.7","Bataille","Vasco",null,"5. III Goler 22"]
[null,null,null,null,null,null,null,null,null,null,null,"5. Zweitm. Vifra 19"]
[41,"Tinka","Familie Fux/Schaller","Eggerberg","N",null,"2021-10-08","120.1328.5257.4","Turin","#Coca",null,"2. II Goler 25"]
[42,"Mandalin","Familie Fux/Schaller","Eggerberg",null,null,"2018-10-12","120.1460.7517.4","Mystic","@Berlusconi",null,"4. V Zermatt 21"]
[43,"Viva","Familie Fux/Schaller","Eggerberg",null,null,"2019-11-10","120.1530.6556.4","Valaisanne","@Fangio"]
[44,"Boba","Familie Fux/Schaller","Eggerberg",null,"II","2020-10-24","120.1599.7688.8","Baquera","@Marquis",null,"4. V Vifra 23"]
[45,"Vagabounde","Familie Fux/Schaller","Eggerberg",null,"II","2020-11-29","120.1599.7691.8","Valaisanne","@Marquis"]
[46,"Balance","Familie Fux/Schaller","Eggerberg","N","IV","2021-09-25","120.1599.7695.6","Bacardi","Tigrou"]
[47,"Barbados","Familie Fux/Schaller","Eggerberg","N","IV","2021-10-10","120.1662.7809.8","Baquera","Tigrou",null,"4. V Vifra 24"]
[48,"Lorens","Gebrüder Jäger","Turtmann",null,null,"2013-10-01","120.1118.9224.9","Micabol","Monza","4. Rotigen 24","5. I Goler 24"]
[null,null,null,null,null,null,null,null,null,null,"13. Rotigen 23","3. I Goler 22"]
[null,null,null,null,null,null,null,null,null,null,"4. Rotigen 22","4. IV Goler 17"]
[null,null,null,null,null,null,null,null,null,null,"9. Rotigen 21"]
[null,null,null,null,null,null,null,null,null,null,"8. Rotigen 20"]
[49,"Simba","Gebrüder Jäger","Turtmann",null,null,"2015-10-01","120.1153.2317.6","Sultane","$Bocassa",null,"7. I Ayent 24"]
[null,null,null,null,null,null,null,null,null,null,null,"4. IV Vifra 19"]
[null,null,null,null,null,null,null,null,null,null,null,"7. V Zermatt 19"]
[50,"Tina","Gebrüder Jäger","Turtmann",null,null,"2017-10-13","120.1300.6942.4","Tirana","@Jenal"]
[51,"Soraya","Gebrüder Jäger","Turtmann",null,null,"2019-09-28","120.1485.8532.9","Sultane","@Rebel"]
[52,"Tokyo","Gebrüder Jäger","Turtmann",null,null,"2019-10-08","120.1485.8533.6","Tiara","@Bison",null,"5. III Goler 24"]
[53,"Tamara","Gebrüder Jäger","Turtmann",null,"II","2020-10-26","120.1485.8545.9","Tiara","#Sultano","4. V Rotigen 23"]
[54,"Tirana","Gebrüder Jäger","Turtmann",null,"II","2020-11-09","120.1485.8546.6","Tanja","@Sultano",null,"4. IV Goler 24"]
[55,"Silene","Gebrüder Jäger","Turtmann","N","IV","2021-12-07","120.1667.7566.5","Sultane","#Biloude"]
[56,"Alena","Hischier H. & Bühlmann J.","Oberems",null,null,"2018-12-06","120.0674.5756.1","Adonis","@Pagnol"]
[57,"Baghira","Hischier H. & Bühlmann J.","Oberems",null,null,"2018-12-11","120.1404.2739.9","Jamanda","@Pagnol"]
[58,"Tara","Hischier H. & Bühlmann J.","Oberems","N","II","2020-11-04","120.1545.6587.2","Jamanda","@Fangio"]
[59,"Cayenne","Hischier H. & Bühlmann J.","Oberems","N","IV","2021-09-27","120.1662.7806.7","Calmy","Tigrou"]
[60,"Cherico","Lauber Noah und Jonas","Agarn","N","II","2020-12-29","120.1541.8050.1","Cobra","@Pagnol"]
[61,"Ramona","Lauber Noah und Jonas","Agarn","N","IV","2022-01-09","120.1685.7844.8","Tonner","@Charly"]
[62,"Metis","Stallung Jäger & Tscherrig","Turtmann",null,null,"2016-11-29","120.1335.1505.8","Mitis","#Prince",null,"6. III Goler 23"]
[null,null,null,null,null,null,null,null,null,null,null,"Königin II Aproz 23"]
[63,"Samba","Stallung Jäger & Tscherrig","Turtmann",null,null,"2017-10-19","120.1335.1511.9","Sera","@Bocassa","11. Rotigen 24"]
[null,null,null,null,null,null,null,null,null,null,"2. Zweitm. Rotigen 22"]
[64,"Flora","Stallung Jäger & Tscherrig","Turtmann",null,null,"2017-10-23","120.1335.1512.6","Fera","Persois","11. Rotigen 24"]
[null,null,null,null,null,null,null,null,null,null,"3. V Rotigen 20"]
[65,"Bijou","Stallung Jäger & Tscherrig","Turtmann","N",null,"2018-12-17","120.1416.5733.7","Bandit","Bogosse"]
[66,"Prunelle","Stallung Jäger & Tscherrig","Turtmann",null,null,"2019-11-12","120.1416.5743.6","Prune","@Tiburon"]
[67,"Santana","Stallung Jäger & Tscherrig","Turtmann",null,null,"2019-12-14","120.1541.4712.2","Sera","#Prince"," ","3. I Goler 25"]
[68,"Sina","Stallung Jäger & Tscherrig","Turtmann",null,"II","2020-10-29","120.1541.4719.1","Sera","Phalanx","2. V Rotigen 23"]
[69,"Pinga","Stallung Jäger & Tscherrig","Turtmann",null,"II","2020-11-01","120.1541.4724.5","Pivoine","Nitro","4. V Rotigen 23"]
[70,"Fanny","Stallung Jäger & Tscherrig","Turtmann","N","IV","2021-09-27","120.1541.4730.6","Flora","#Livio","2. V Rotigen 24","7. V Vifra 24"]
[71,"Bogota","Stallung Jäger & Tscherrig","Turtmann","N","IV","2021-09-30","120.1541.4732.0","Beline","#Livio"]
[72,"Forza","Stallung Jäger & Tscherrig","Turtmann","N","IV","2021-11-21","120.1664.2437.2","Ferra","#Prince"]
[73,"Melodie","Stallung Jäger & Tscherrig","Turtmann","N","IV","2021-11-24","120.1664.2439.6","Megane","#Livio"]
[74,"Medusa","Stallung Jäger & Tscherrig","Turtmann","N","IV","2021-11-29","120.1664.2443.3","Metis","#Livio",null,"2. V Vifra 24"]
[75,"Finet","Stallung Mussmann","Steg",null,null,"2017-12-25","120.1339.0200.1","Frimousse","@Disco"]
[76,"Xenia","Stallung Mussmann","Steg",null,"II","2020-10-13","120.1529.2011.6","Xijlana","Rocky"]
[77,"Bonita","Stallung Passeraub","Getwing",null,null,"2014-01-08","120.1118.4001.1","Bombache","Mali","8. Rotigen 24"]
[78,"Belana","Stallung Passeraub","Getwing",null,null,"2018-10-10","120.1405.6860.3","Baghera","#Fedulov","Königin Zweitm. Rotigen 23"]
[null,null,null,null,null,null,null,null,null,null,"2. IV Rotigen 22 (Gr. Kühe)"]
[null,null,null,null,null,null,null,null,null,null,"Königin V Rotigen 21"]
[79,"Beluga","Stallung Passeraub","Getwing",null,null,"2018-10-10","120.1405.6861.0","Baghera","#Fedulov","2. V Rotigen 21"]
[80,"Boriana","Stallung Passeraub","Getwing",null,null,"2018-10-19","120.1405.6865.8","Bonita","#Fedulov"]
[81,"Bolienne","Stallung Passeraub","Getwing",null,null,"2019-11-28","120.1526.1438.1","Baghera","#Corbi"]
[82,"Bandera","Stallung Passeraub","Getwing",null,null,"2019-12-23","120.1546.4961.9","Ballerine","#Calimero",null,"6. IV Goler 23"]
[83,"Belle","Stallung Passeraub","Getwing","N","IV","2021-10-06","120.1608.8154.6","Belana","$Coison","5. V Rotigen 24"]
[84,"Brachial","Stallung Passeraub","Getwing","N","IV","2021-12-29","120.1677.0283.7","Bonita","#Lotus"]
[85,"Fiona","Hutter Richard","Lalden","N","IV","2021-11-03","120.1677.0277.6","Fagar","#Lotus"]
[86,"Cayenne","Stallung zum Stäg","St. Niklaus",null,null,"2015-12-25","120.1258.8839.9","Chealsy","Tao"]
[87,"Boreale","Perrin Jacques","Praz-de-Fort","N","IV","2022-02-05","120.1706.4912.9","Baikal","#Milord"]
[88,"Dorin","Williner Anton","Visp","N",null,"2017-10-25","120.1393.5220.6","Diva","Vitello"]
[89,"Timba","Williner Anton","Visp","N",null,"2019-10-29","120.1393.5219.0","Trix","Chorizo"]
[90,"Venus","Williner Anton","Visp",null,null,"2019-11-08","120.1393.5182.7","Vanda","Northon","2. IV Rotigen 23 (Brändji)","6. IV Aproz 23"]
[91,"Tirana","Williner Anton","Visp",null,null,"2019-12-30","120.1393.5198.8","Tira","Vitello","Königin IV Rot. 23 (Brändji)","3. IV Vifra 23"]
[null,null,null,null,null,null,null,null,null,null,"3. V Biffiga 22"]
[92,"Xena","Zumofen / Gattlen","Turtmann",null,null,"2012-10-13","120.1051.2928.3","Xenti","@Caribou","3. Rotigen 24"]
[null,null,null,null,null,null,null,null,null,null,"Königin Rotigen 23"]
[null,null,null,null,null,null,null,null,null,null,"Königin Rotigen 22"]
[null,null,null,null,null,null,null,null,null,null,"3. Rotigen 21"]
[null,null,null,null,null,null,null,null,null,null,"2. Rotigen 20"]
[null,null,null,null,null,null,null,null,null,null,"3. Rotigen 19"]
[93,"Souris","Zumofen / Gattlen","Turtmann","N",null,"2015-10-10","120.1196.8739.7","Souris","#Capo",null,"6. II Chermignon 25"]
[null,null,null,null,null,null,null,null,null,null,null,"Königin I Fully 23"]
[null,null,null,null,null,null,null,null,null,null,null,"6. IV Goler 19"]
[94,"Vesuv","Zumofen / Gattlen","Turtmann",null,null,"2016-11-11","120.1269.9558.4","Volero","#Torro","11. Rotigen 24","3. II Chermignon 25"]
[null,null,null,null,null,null,null,null,null,null,null,"2. III Goler 23"]
[95,"Rena","Zumofen / Gattlen","Turtmann",null,null,"2016-01-30","120.1269.9552.2","Ruby","@Caribou","11. Rotigen 24","5. I Goler 23"]
[null,null,null,null,null,null,null,null,null,null,"11. Rotigen 23"]
[null,null,null,null,null,null,null,null,null,null,"14. Rotigen 22"]
[96,"Rigolo","Zumofen / Gattlen","Turtmann",null,null,"2016-10-08","120.1269.9554.6","Rocky","$Breona","4. Rotigen 24","4. II Aproz 23"]
[null,null,null,null,null,null,null,null,null,null,"14. Rotigen 23"]
[97,"Xea","Zumofen / Gattlen","Turtmann",null,null,"2018-11-20","120.1402.0674.1","Xena","#Concorde",null,"2. I Goler 25"]
[null,null,null,null,null,null,null,null,null,null,null,"5. IV Vifra 22"]
[98,"Roquette","Zumofen / Gattlen","Turtmann",null,null,"2019-11-08","120.1524.2753.0","Rocky","@Pagnol","Königin Zweitm. Rot. 24"]
[99,"Fame","Zumofen / Gattlen","Turtmann",null,"II","2020-10-25","120.1609.2577.6","Fayola","Felix"]
[100,"Valdeeze","Zumofen / Gattlen","Turtmann",null,"II","2020-11-02","120.1609.2579.0","Violette","Felix"]
[101,"Verygood","Zumofen / Gattlen","Turtmann",null,"II","2020-11-20","120.1609.2582.0","Vanda","Felix",null,"7. Kantonal IV 24"]
[null,null,null,null,null,null,null,null,null,null,null,"5. IV Goler 24"]
[102,"Xenia","Zumofen / Gattlen","Turtmann","N","IV","2021-10-15","120.1673.3924.8","Xana","#Vilar"]
[103,"Adonis","Zumofen / Gattlen","Turtmann","N","IV","2021-10-20","120.1597.3914.8","Adonis","$Breona",null,"3. IV Goler 25"]
[104,"Calcuta","Zumofen / Gattlen","Turtmann","N","IV","2021-10-20","120.1673.3925.5","Calcuta","#Vilar"]
[105,"Roxana","Zumofen / Gattlen","Turtmann","N","IV","2021-11-04","120.1673.3927.9","Rigolo","#Sultano"]
[]
["Viel Vergnügen und spannende Kämpfe wünscht die Alpgenossenschaft Turtmanntal und die Bestosser der Alpe Rotigen"]
[null,null,null,null,null,null,null,null,null,null,null,"© Alpe Rotigen"]

{"sheet":"2024","index":3,"n_rows":150,"n_cols":12,"rows_kept":150,"cut":false,"hidden":false,"merged":[[0,0,0,11],[2,0,2,11],[24,0,27,0],[24,1,27,1],[24,2,27,2],[24,3,27,3],[24,6,27,6],[24,7,27,7],[140,7,141,7],[140,8,141,8],[65,6,68,6],[65,7,68,7],[65,8,68,8],[55,7,56,7],[28,8,29,8],[24,8,27,8],[24,9,27,9],[28,0,29,0],[28,1,29,1],[28,2,29,2],[28,3,29,3],[28,4,29,4],[28,5,29,5],[28,6,29,6],[28,7,29,7],[28,9,29,9],[30,0,31,0],[30,1,31,1],[30,2,31,2],[30,3,31,3],[30,4,31,4],[30,5,31,5],[30,6,31,6],[30,7,31,7],[30,8,31,8],[30,9,31,9],[32,9,33,9],[34,0,35,0],[34,1,35,1],[34,2,35,2],[34,3,35,3],[34,4,35,4],[34,5,35,5],[34,6,35,6],[34,7,35,7],[34,8,35,8],[34,9,35,9],[32,0,33,0],[32,1,33,1],[32,2,33,2],[32,3,33,3],[32,4,33,4],[32,5,33,5],[32,6,33,6],[32,7,33,7],[32,8,33,8],[46,9,47,9],[46,10,47,10],[48,0,49,0],[48,1,49,1],[48,2,49,2],[48,3,49,3],[48,4,49,4],[48,5,49,5],[48,6,49,6],[48,7,49,7],[48,8,49,8],[48,9,49,9],[48,10,49,10],[46,0,47,0],[46,1,47,1],[46,2,47,2],[46,3,47,3],[46,4,47,4],[46,5,47,5],[46,6,47,6],[46,7,47,7],[46,8,47,8],[55,10,56,10],[58,0,59,0],[58,1,59,1],[58,2,59,2],[58,3,59,3],[58,4,59,4],[58,5,59,5],[58,6,59,6],[58,7,59,7],[58,8,59,8],[58,9,59,9],[58,10,59,10],[55,0,56,0],[55,1,56,1],[55,2,56,2],[55,3,56,3],[55,4,56,4],[55,5,56,5],[55,6,56,6],[55,8,56,8],[55,9,56,9],[65,0,68,0],[65,1,68,1],[65,2,68,2],[65,3,68,3],[65,4,68,4],[65,5,68,5],[65,9,68,9],[69,0,71,0],[69,1,71,1],[69,2,71,2],[69,3,71,3],[69,4,71,4],[69,5,71,5],[69,6,71,6],[69,7,71,7],[69,8,71,8],[69,9,71,9],[87,9,92,9],[96,0,97,0],[96,1,97,1],[96,2,97,2],[96,3,97,3],[96,4,97,4],[96,5,97,5],[96,6,97,6],[96,7,97,7],[96,8,97,8],[96,9,97,9],[87,0,92,0],[87,1,92,1],[87,2,92,2],[87,3,92,3],[87,4,92,4],[87,5,92,5],[87,6,92,6],[87,7,92,7],[87,8,92,8],[96,10,97,10],[103,0,106,0],[103,1,106,1],[103,2,106,2],[103,3,106,3],[103,4,106,4],[103,5,106,5],[103,6,106,6],[103,7,106,7],[103,8,106,8],[103,9,106,9],[109,9,111,9],[116,0,117,0],[116,1,117,1],[116,2,117,2],[116,3,117,3],[116,4,117,4],[116,5,117,5],[116,6,117,6],[116,7,117,7],[116,8,117,8],[116,9,117,9],[109,0,111,0],[109,1,111,1],[109,2,111,2],[109,3,111,3],[109,4,111,4],[109,5,111,5],[109,6,111,6],[109,7,111,7],[109,8,111,8],[126,9,127,9],[126,10,127,10],[130,0,131,0],[130,1,131,1],[130,2,131,2],[130,3,131,3],[130,4,131,4],[130,5,131,5],[130,6,131,6],[130,7,131,7],[130,8,131,8],[130,9,131,9],[126,0,127,0],[126,1,127,1],[126,2,127,2],[126,3,127,3],[126,4,127,4],[126,5,127,5],[126,6,127,6],[126,7,127,7],[126,8,127,8],[132,0,136,0],[132,1,136,1],[132,2,136,2],[132,3,136,3],[132,4,136,4],[132,5,136,5],[132,6,136,6],[140,9,141,9],[132,7,136,7],[132,8,136,8],[132,9,136,9],[140,0,141,0],[140,1,141,1],[140,2,141,2],[140,3,141,3],[140,4,141,4],[140,5,141,5],[140,6,141,6]]}
["ALPE ROTIGEN TURTMANNTAL"]
[]
["Alpaufzug vom 15. Juni 2024"]
[]
[null,null,"Trupposiegerin",96,null,null,"Tiere",null,null,"2023 klassiert und nicht da"]
[]
[null,null,"Klassiert 2023",21,null,"IV","Erstmelken",null,null,"Canaille Bregy Ralf & Adolf (8 te)"]
[null,null,null,null,null,null,null,null,null,"Creola Bregy Ralf & Adolf (11 te)"]
[null,null,"Königin 2023",33,null,"N","Neu (2023 nicht da)",null,null,"Megane Jäger Carlo & Lukas (15 te)"]
[]
[null,null,null,48,null,null,"Glocken an Ringkuhkämpfen"]
[]
[null,null,null,33,null,null,"Klassierte Tiere an Ringkuhkämpfen"]
[]
["Nr.","Name","Besitzer","Ort",null,null,"Geb.","BDTA","Mutter","Vater","Klassierungen Alpe","Klassierungen Match"]
[1,"Mira","Bayard Medard & Gustav","N'Gampel",null,null,"2017-12-08","120.0618.4541.8","Mirabelle","Samurai"]
[2,"Mamba","Bayard Medard & Gustav","N'Gampel",null,null,"2018-10-01","120.1449.8998.5","Malice","#Vilar","Königin IV Rot. 22 (Brändji)","2 te IV Goler 22"]
[3,"Paloma","Bayard Medard & Gustav","N'Gampel",null,null,"2019-11-01","120.1474.9048.8","Priska","@Tiburon"]
[4,"Vampir","Bayard Medard & Gustav","N'Gampel",null,null,"2015-10-01","120.0618.4536.4","Violette","@Melchior"]
[5,"Promesse","Bayard Medard & Gustav","N'Gampel","N",null,"2019-10-01","120.1474.9045.7","Pandera","Mesquin"]
[6,"Valerie","Bayard Medard & Gustav","N'Gampel","N",null,"2019-10-01","120.1474.9046.4","Vampir","@Tiburon","3 te IV Rotigen 22 (Brändji)","5 te IV Goler 23"]
[7,"Champion ","Bregy Ralf & Adolf","Unterems",null,null,"2019-11-01","120.1469.3321.4","Coquette","#Dracula","2 te V Zinal 22"]
[8,"Celtis","Bregy Ralf & Adolf","Unterems","N","IV","2020-09-01","120.1469.3322.1","Celtic","@Cervin","2 te V Zinal 23","Königin V Aproz 23"]
[9,"Coquette","Bregy Ralf & Adolf","Unterems",null,null,"2016-10-01","120.1255.5043.2","Canaille","#Ziro","7 te Rotigen 23","3 te I Aproz 23"]
[10,"Diabolo","Bregy Anja","Unterems",null,null,"2014-10-01","120.0591.9312.5","Creola","#Teiro","15 te Rotigen 23","Königin I Goler 22"]
[null,null,null,null,null,null,null,null,null,null,"13 te Rotigen 22","Königin Zweitm. Vifra 19"]
[null,null,null,null,null,null,null,null,null,null,"13 te Rotigen 21","4 te IV Martigny 18"]
[null,null,null,null,null,null,null,null,null,null,"15 te Rotigen 20"]
[11,"Cashida","Bregy Ralf & Adolf","Unterems",null,null,"2016-09-01","120.1255.5038.8","Clairon","$Breona","9 te Rotigen 23","7 te II Aproz 22"]
[null,null,null,null,null,null,null,null,null,null,"13 te Rotigen 22","2 te V Goler 19"]
[12,"Mirage","Bregy Silvan & Patrick","Unterems",null,null,"2019-10-01","120.1469.3319.1","Milow","#Casino","Königin IV Rot. 22 (Gr. Kühe)"]
[null,null,null,null,null,null,null,null,null,null,"4 te V Zinal 22"]
[13,"Tonique","Bregy Silvan & Patrick","Unterems",null,null,"2018-11-01","120.1255.5056.2","Tequilla","#Casino","3 te IV Rot. 22 (Gr. Kühe)","3 te V Goler 21"]
[null,null,null,null,null,null,null,null,null,null,"Königin V Zinal 21"]
[14,"Canabis","Bregy Ralf & Adolf","Unterems",null,null,"2015-11-01","120.1255.5036.4","Canaille","@Bison","9 te Rotigen 23","2 te I Aproz 22"]
[null,null,null,null,null,null,null,null,null,null,"10 te Rotigen 22","2 teI V Vifra 19"]
[15,"Damaris","Bregy Anja","Unterems","N","IV","2020-10-01","120.1469.3323.8","Diabolo","#Cresus","6 te V Zinal 23"]
[16,"Combat","Bregy Ralf & Adolf","Unterems","N","IV","2020-10-01","120.1469.3328.3","Coeur","@Caribou","4 te V Zinal 23"]
[17,"Claris","Bregy Ralf & Adolf","Unterems","N","IV","2020-09-01","120.1469.3324.5","Cayenne","@Marquis","3 te V Zinal 23"]
[18,"Cataille","Bregy Uli, Lisi & Pascal","Ergisch",null,null,"2018-12-01","120.1461.2271.7","Catalina","@Pagnol",null,"6 te Zweitm. Vifra 23"]
[19,"Perona","Bregy Uli, Lisi & Pascal","Ergisch",null,null,"2018-10-12","120.1394.8450.1","Pandora","Bandito",null,"4 te IV Goler 22"]
[20,"Tirana","Bregy Uli, Lisi & Pascal","Ergisch",null,null,"2019-11-01","120.1531.4905.9","Tiranie","$Neron"]
[21,"Bimba","Bühlmann Bruno & Sandra","Burgistein","N",null,"2015-11-01","120.1113.9895.6","Bruna","@Filou"]
[22,"Toutex","Bühlmann Bruno & Sandra","Burgistein","N",null,"2017-10-01","120.1255.5046.3","Toupie","#Texas"]
[23,"Lavinja","Bühlmann Bruno & Sandra","Burgistein","N",null,"2015-10-01","120.1113.9894.9","Lola ","#Filou"]
[24,"Larissa","Bühlmann Bruno & Sandra","Burgistein","N",null,"2018-01-01","120.1258.3689.5","Ladina","@Fangio"]
[25,"Tyson","Fam. Leiggener","Turtmann","N","IV","2020-10-01","120.1537.2537.6","Tigres","$Breona",null,"Königin V Goler 23"]
[null,null,null,null,null,null,null,null,null,null,null,"4 te V Kantonal 23"]
[26,"Royale","Fam. Leiggener","Turtmann","N",null,"2019-12-01","120.1537.2532.1","Rebelle","$Breona",null,"5 te Espace MB 23"]
[null,null,null,null,null,null,null,null,null,null,null,"Königin V Goler 22"]
[27,"Tirana","Fam. Leiggener","Turtmann",null,null,"2019-11-01","120.1537.2531.4","Tigres","Pandor"]
[28,"Colette","Fam. Leiggener","Turtmann",null,null,"2018-11-23","120.1467.1536.0","Clochette","$Bello",null,"3 te II Goler 24"]
[29,"Rocky","Fam. Leiggener","Turtmann","N","IV","2020-12-01","120.1537.2538.3","Rebelle","#Buddy"]
[30,"Bastis","Familie Fux/Schaller","Eggerberg","N",null,"2017-10-01","120.1291.2700.5","Bataille","#Turco"]
[31,"Bolero","Familie Fux/Schaller","Eggerberg",null,null,"2013-11-11","120.1119.8616.0","Baguera","Tiger"]
[32,"Bacardi","Familie Fux/Schaller","Eggerberg",null,null,"2014-10-01","120.1186.6938.7","Bataille","Vasco",null,"5 te III Goler 22"]
[null,null,null,null,null,null,null,null,null,null,null,"5 te Zweitm. Vifra 19"]
[33,"Mandalin","Familie Fux/Schaller","Eggerberg",null,null,"2018-10-12","120.1460.7517.4","Mystic","@Berlusconi",null,"4 te V Zermatt 21"]
[34,"Toscana","Familie Fux/Schaller","Eggerberg",null,null,"2014-10-01","120.1186.6939.4","Tarzan","Tiger",null,"Königin III Aproz 23"]
[null,null,null,null,null,null,null,null,null,null,null,"Königin V Vifra 17"]
[35,"Boba","Familie Fux/Schaller","Eggerberg","N","IV","2020-10-01","120.1599.7688.8","Baquera","@Marquis",null,"4 te V Goler 23"]
[36,"Vagabounde","Familie Fux/Schaller","Eggerberg","N","IV","2020-11-01","120.1599.7691.8","Valaisanne","@Marquis"]
[37,"Viva","Familie Fux/Schaller","Eggerberg",null,null,"2019-11-01","120.1530.6556.4","Valaisanne","@Fangio"]
[38,"Tina","Gebrüder Jäger","Turtmann",null,null,"2017-10-13","120.1300.6942.4","Tirana","@Jenal"]
[39,"Tokyo","Gebrüder Jäger","Turtmann",null,null,"2019-10-01","120.1485.8533.6","Tiara","@Bison",null,"5 te III Goler 24"]
[40,"Lorens","Gebrüder Jäger","Turtmann",null,null,"2013-10-01","120.1118.9224.9","Micabol","Monza","13 te Rotigen 23","5 te I Goler 24"]
[null,null,null,null,null,null,null,null,null,null,"4 te Rotigen 22","3 te I Goler 22"]
[null,null,null,null,null,null,null,null,null,null,"9 te Rotigen 21","4 te IV Goler 17"]
[null,null,null,null,null,null,null,null,null,null,"8 te Rotigen 20"]
[41,"Simba","Gebrüder Jäger","Turtmann",null,null,"2015-10-01","120.1153.2317.6","Sultane","$Bocassa",null,"7 te I Ayent 24"]
[null,null,null,null,null,null,null,null,null,null,null,"4 te IV Vifra 19"]
[null,null,null,null,null,null,null,null,null,null,null,"7 te V Zermatt 19"]
[42,"Tara","Gebrüder Jäger","Turtmann",null,null,"2017-11-21","120.1395.5441.9","Taylor","#Picador"]
[43,"Soraya","Gebrüder Jäger","Turtmann",null,null,"2019-09-01","120.1485.8532.9","Sultane","@Rebel"]
[44,"Tamara","Gebrüder Jäger","Turtmann","N","IV","2020-10-01","120.1485.8545.9","Tiara","#Sultano"]
[45,"Tacia","Gebrüder Jäger","Turtmann","N","IV","2020-10-01","120.1485.8542.8","Tara","#Sultano"]
[46,"Tirana","Gebrüder Jäger","Turtmann","N","IV","2020-11-01","120.1485.8546.6","Tanja","@Sultano"]
[47,"Baghira","Hischier H. & Bühlmann J.","Oberems",null,null,"2018-12-01","120.1404.2739.9","Jamanda","@Pagnol"]
[48,"Alena","Hischier H. & Bühlmann J.","Oberems",null,null,"2018-12-01","120.0674.5756.1","Adonis","@Pagnol"]
[49,"Baghira","Hischier Pius","Unterems",null,null,"2019-10-01","120.1460.7530.3","Baquera","@Clinton"]
[50,"Pandora","Hischier Pius","Unterems",null,null,"2019-12-01","120.1324.6176.9","Pablo","@Pascha"]
[51,"Santana","Stallung Jäger & Tscherrig","Turtmann",null,null,"2019-12-01","120.1541.4712.2","Sera","#Prince"," "]
[52,"Beline","Stallung Jäger & Tscherrig","Turtmann",null,null,"2018-10-30","120.1416.5725.2","Bataille","Bogosse",null,"7 te IV Goler 22"]
[53,"Xenia","Stallung Mussmann","Steg","N","IV","2020-10-01","120.1529.2011.6","Xijlana","Rocky"]
[54,"Finet","Stallung Mussmann","Steg",null,null,"2017-12-25","120.1339.0200.1","Frimousse","@Disco"]
[55,"Flora","Stallung Jäger & Tscherrig","Turtmann",null,null,"2017-10-23","120.1335.1512.6","Fera","Persois","3 te V Rotigen 20"]
[56,"Prunelle","Stallung Jäger & Tscherrig","Turtmann",null,null,"2019-11-01","120.1416.5743.6","Prune","@Tiburon"]
[57,"Sera","Stallung Jäger & Tscherrig","Turtmann",null,null,"2014-10-01","120.1151.1686.0","Brunette","Zetor","3 te Rotigen 23"]
[null,null,null,null,null,null,null,null,null,null,"5 te Rotigen 22"]
[null,null,null,null,null,null,null,null,null,null,"9 te Rotigen 21"]
[null,null,null,null,null,null,null,null,null,null,"11 te Rotigen 20"]
[null,null,null,null,null,null,null,null,null,null,"2 te IV Rotigen 18"]
[null,null,null,null,null,null,null,null,null,null,"3 te V Rotigen 17"]
[58,"Pinga","Stallung Jäger & Tscherrig","Turtmann","N","IV","2020-11-01","120.1541.4724.5","Pivoine","Nitro"]
[59,"Sina","Stallung Jäger & Tscherrig","Turtmann","N","IV","2020-10-01","120.1541.4719.1","Sera","Phalanx","2 te V Rotigen 23"]
[60,"Mekka","Stallung Jäger & Tscherrig","Turtmann","N","IV","2020-11-01","120.1541.4722.1","Megane","Socrates"]
[61,"Metis","Stallung Jäger & Tscherrig","Turtmann",null,null,"2016-11-01","120.1335.1505.8","Mitis","#Prince",null,"6 te III Goler 23"]
[null,null,null,null,null,null,null,null,null,null,null,"Königin II Aproz 23"]
[62,"Samba","Stallung Jäger & Tscherrig","Turtmann",null,null,"2017-10-19","120.1335.1511.9","Sera","@Bocassa","2 te Zweitmelken Rot. 22"]
[63,"Boriana","Stallung Passeraub","Getwing",null,null,"2018-10-01","120.1405.6865.8","Bonita","#Fedulov"]
[64,"Briona","Leiggener Sven & Joelle","Getwing",null,null,"2018-10-01","120.1405.6863.4","Bobino","Vivo",null,"4 te IV Goler 22"]
[65,"Bandera","Stallung Passeraub","Getwing",null,null,"2019-12-01","120.1546.4961.9","Ballerine","#Calimero",null,"6 te IV Goler 23"]
[66,"Bolienne","Stallung Passeraub","Getwing",null,null,"2019-11-01","120.1526.1438.1","Baghera","#Corbi"]
[67,"Ballerine","Stallung Passeraub","Getwing",null,null,"2014-12-01","120.1188.5412.7","Bombache","Cactus","2 te Rotigen 23","6 te IV Kantonal 18"]
[null,null,null,null,null,null,null,null,null,null,"6 te Rotigen 21","3 te IV Goler 18"]
[null,null,null,null,null,null,null,null,null,null,"Königin IV Rotigen 18"]
[null,null,null,null,null,null,null,null,null,null,"Königin V Rotigen 17"]
[68,"Bonita","Stallung Passeraub","Getwing","N",null,"2014-01-01","120.1118.4001.1","Bombache","Mali"]
[69,"Beluga","Stallung Passeraub","Getwing",null,null,"2018-10-10","120.1405.6861.0","Baghera","#Fedulov","2 te V Rotigen 21"]
[70,"Belana","Stallung Passeraub","Getwing",null,null,"2018-10-10","120.1405.6860.3","Baghera","#Fedulov","Königin Zweitm. Rot. 23"]
[null,null,null,null,null,null,null,null,null,null,"2 te IV Rot. 22 (Gr. Kühe)"]
[null,null,null,null,null,null,null,null,null,null,"Königin V Rotigen 21"]
[71,"Benschaby","Stallung zum Stäg","St. Niklaus",null,null,"2018-12-01","120.1464.0313.7","Benika","@Donizetti"]
[72,"Cayenne","Stallung zum Stäg","St. Niklaus",null,null,"2015-12-25","120.1258.8839.9","Chealsy","Tao"]
[73,"Tomba","Tscherry E. & B.","Agarn",null,null,"2017-11-01","120.1349.1597.0","Tulip","@Jenal"]
[74,"Tutti","Tscherry E. & B.","Agarn",null,null,"2019-11-01","120.1541.8041.9","Tina","Salome"]
[75,"Tirana","Williner Anton","Visp","N",null,"2019-12-01","120.1393.5198.8","Tira","Vitello","Königin IV Rot. 23 (Brändji)"]
[null,null,null,null,null,null,null,null,null,null,"3 te V Biffiga 22","3 te IV Goler 23"]
[76,"Venus","Williner Anton","Visp","N",null,"2019-11-01","120.1393.5182.7","Vanda","Northon","2 te IV Rotigen 23 (Brändji)","6 te IV Aproz 23"]
[77,"Violine","Williner Anton","Visp",null,null,"2016-12-01","120.1252.8373.6","Vivana","Vancouver"]
[78,"Tonic","Williner Anton","Visp",null,null,"2017-10-25","120.1252.8388.0","Tara","Vampire"]
[79,"Fame","Zumofen / Gattlen","Turtmann","N","IV","2020-10-01","120.1609.2577.6","Fayola","Felix"]
[80,"Fiesta","Zumofen / Gattlen","Turtmann","N","IV","2020-11-01","120.1609.2580.6","Fatalle","@Melchior"]
[81,"Pessaro","Zumofen / Gattlen","Turtmann","N","IV","2020-12-01","120.1609.2584.4","Pinoccio","#Fangio"]
[82,"Rega","Zumofen / Gattlen","Turtmann","N","IV","2020-11-01","120.1609.2581.3","Rena","Felix"]
[83,"Valdeeze","Zumofen / Gattlen","Turtmann","N","IV","2020-11-01","120.1609.2579.0","Violette","Felix"]
[84,"Verygood","Zumofen / Gattlen","Turtmann","N","IV","2020-11-01","120.1609.2582.0","Vanda","Felix",null,"5 te IV Goler 24"]
[null,null,null,null,null,null,null,null,null,null,null,"7 te Kantonal IV 24"]
[85,"Vesuv","Zumofen / Gattlen","Turtmann","N",null,"2016-11-01","120.1269.9558.4","Volero","#Torro",null,"2 te III Goler 23"]
[86,"Violette","Zumofen / Gattlen","Turtmann",null,null,"2015-09-01","120.1201.9782.3","Volero","$Breona","10 te Rotigen 23","5 te II Goler 23"]
[87,"Rena","Zumofen / Gattlen","Turtmann",null,null,"2016-01-01","120.1269.9552.2","Ruby","@Caribou","11 te Rotigen 23","5 te I Goler 23"]
[null,null,null,null,null,null,null,null,null,null,"14 te Rotigen 22"]
[88,"Xena","Zumofen / Gattlen","Turtmann",null,null,"2012-10-01","120.1051.2928.3","Xenti","@Caribou","Königin Rotigen 23"]
[null,null,null,null,null,null,null,null,null,null,"Königin Rotigen 22"]
[null,null,null,null,null,null,null,null,null,null,"3 te Rotigen 21"]
[null,null,null,null,null,null,null,null,null,null,"2 te Rotigen 20"]
[null,null,null,null,null,null,null,null,null,null,"3 te Rotigen 19"]
[89,"Rigolo","Zumofen / Gattlen","Turtmann",null,null,"2016-10-01","120.1269.9554.6","Rocky","$Breona","14 te Rotigen 23","4 te II Aproz 23"]
[90,"Xana","Zumofen / Gattlen","Turtmann",null,null,"2017-12-11","120.1402.0663.5","Xena","#Marsal"]
[91,"Roquette","Zumofen / Gattlen","Turtmann",null,null,"2019-11-01","120.1524.2753.0","Rocky","@Pagnol"]
[92,"Rabiata","Zumofen / Gattlen","Turtmann",null,null,"2018-10-13","120.1402.0667.3","Rambo","#Concorde","2 te Zweitm. Rotigen 23"]
[null,null,null,null,null,null,null,null,null,null,"2 te IV Rot. 22 (Gr. Kühe)"]
[93,"Bellissima","Zumofen / Gattlen","Turtmann",null,null,"2018-09-14","120.1402.0666.6","Bellon","Sabata"]
[94,"Fakir","Zumofen / Gattlen","Turtmann",null,null,"2018-11-08","120.1402.0672.7","Fatale","#Ziro"]
[95,"Xea","Zumofen / Gattlen","Turtmann",null,null,"2018-11-20","120.1402.0674.1","Xena","#Concorde",null,"5 te IV Vifra 22"]
[96,"Vania","Zumofen / Gattlen","Turtmann",null,null,"2019-11-01","120.1525.0484.2","Violin","#VILAR"]
[]
[]
["Viel Vergnügen und spannende Kämpfe wünscht die Alpgenossenschaft Turtmanntal und die Bestosser der Alpe Rotigen"]
[null,null,null,null,null,null,null,null,null,null,null,"© Alpe Rotigen"]

{"sheet":"2023","index":4,"n_rows":166,"n_cols":13,"rows_kept":166,"cut":false,"hidden":false,"merged":[[0,0,0,12],[2,0,2,12],[21,0,27,0],[21,1,27,1],[21,3,27,3],[21,4,27,4],[21,7,27,7],[21,8,27,8],[21,9,27,9],[21,10,27,10],[28,9,34,9],[28,10,34,10],[36,0,38,0],[36,1,38,1],[36,3,38,3],[36,4,38,4],[36,7,38,7],[36,8,38,8],[36,9,38,9],[36,10,38,10],[28,0,34,0],[28,1,34,1],[28,3,34,3],[28,4,34,4],[28,7,34,7],[28,8,34,8],[39,9,40,9],[39,10,40,10],[42,0,43,0],[42,1,43,1],[42,3,43,3],[42,4,43,4],[42,7,43,7],[42,8,43,8],[42,9,43,9],[42,10,43,10],[39,0,40,0],[39,1,40,1],[39,3,40,3],[39,4,40,4],[39,7,40,7],[39,8,40,8],[44,9,45,9],[44,10,45,10],[52,0,54,0],[52,1,54,1],[52,3,54,3],[52,4,54,4],[52,7,54,7],[52,8,54,8],[52,9,54,9],[52,10,54,10],[44,0,45,0],[44,1,45,1],[44,3,45,3],[44,4,45,4],[44,7,45,7],[44,8,45,8],[53,16,54,16],[55,0,57,0],[55,1,57,1],[55,3,57,3],[55,4,57,4],[55,7,57,7],[55,8,57,8],[55,9,57,9],[55,10,57,10],[67,9,68,9],[67,10,68,10],[70,0,71,0],[70,1,71,2],[70,3,71,3],[70,4,71,4],[70,7,71,7],[70,8,71,8],[70,9,71,9],[70,10,71,10],[67,0,68,0],[67,1,68,1],[67,3,68,3],[67,4,68,4],[67,7,68,7],[67,8,68,8],[77,9,79,9],[77,10,79,10],[80,0,81,0],[80,1,81,1],[80,3,81,3],[80,4,81,4],[80,7,81,7],[80,8,81,8],[80,9,81,9],[80,10,81,10],[77,0,79,0],[77,1,79,1],[77,3,79,3],[77,4,79,4],[77,7,79,7],[77,8,79,8],[97,9,101,9],[97,10,101,10],[114,0,115,0],[114,1,115,1],[114,3,115,3],[114,4,115,4],[114,7,115,7],[114,8,115,8],[114,9,115,9],[114,10,115,10],[97,0,101,0],[97,1,101,1],[97,3,101,3],[97,4,101,4],[97,7,101,7],[97,8,101,8],[123,9,125,9],[123,10,125,10],[136,0,138,0],[136,1,138,1],[136,3,138,3],[136,4,138,4],[136,7,138,7],[136,8,138,8],[136,9,138,9],[136,10,138,10],[123,0,125,0],[123,1,125,1],[123,3,125,3],[123,4,125,4],[123,7,125,7],[123,8,125,8],[155,9,158,9],[155,10,158,10],[155,0,158,0],[155,1,158,1],[155,3,158,3],[155,4,158,4],[155,7,158,7],[155,8,158,8],[139,9,141,9],[139,10,141,10],[153,0,154,0],[153,1,154,1],[153,3,154,3],[153,4,154,4],[153,7,154,7],[153,8,154,8],[153,9,154,9],[153,10,154,10],[139,0,141,0],[139,1,141,1],[139,3,141,3],[139,4,141,4],[139,7,141,7],[139,8,141,8]]}
["ALPE ROTIGEN TURTMANNTAL"]
[]
["Alpaufzug vom 17. Juni 2023"]
[]
[null,null,null,"Trupposiegerin",105,null,null,"Tiere",null,null,"2022 klassiert und nicht da"]
[]
[null,null,null,"Klassiert 2022",23,null,"IV","Erstmelken",null,null,"Milow Bregy Silvan & Patrick (9 te)"]
[null,null,null,null,null,null,null,null,null,null,"Tequila Bregy Silvan & Patrick (12 te)"]
[null,null,null,"Königin 2022",35,null,"N","Neu (2022 nicht da)"]
[]
[null,null,null,null,49,null,null,"Glocken an Ringkuhkämpfen"]
[]
[null,null,null,null,34,null,null,"Klassierte Tiere an Ringkuhkämpfen"]
[]
["Nr.","Name",null,"Besitzer","Ort",null,null,"Geb.","BDTA","Mutter","Vater","Klassierungen Alpe","Klassierungen Match"]
[1,"Mira",null,"Bayard Medard & Gustav","N'Gampel",null,null,"2017-12-08","120.0618.4541.8","Mirabelle","Samurai"]
[2,"Mamba",null,"Bayard Medard & Gustav","N'Gampel","N",null,"2018-10-01","120.1449.8998.5","Malice","#VILAR","1 te IV Rotigen 22 (Brändji)","2 te IV Goler 22"]
[3,"Paloma",null,"Bayard Medard & Gustav","N'Gampel","N","IV","2019-11-01","120.1474.9048.8","Priska","@TIBURON"]
[4,"Vampir",null,"Bayard Medard & Gustav","N'Gampel",null,null,"2015-10-01","120.0618.4536.4","Violette","@MELCHIOR"]
[5,"Clairon ",null,"Bregy Ralf & Adolf","Unterems",null,null,"2018-11-01","120.1255.5060.9","Canabis","Romulus","3 te V Zinal 21"]
[6,"Champion ",null,"Bregy Ralf & Adolf","Unterems","N","IV","2019-11-01","120.1469.3321.4","Coquette","#DRACULA","2 te V Zinal 22"]
[7,"Canaille",null,"Bregy Ralf & Adolf","Unterems",null,null,"2012-10-01","120.0931.3322.4","Chealsy","$BREONA","3 te Rotigen 22","4 te V Goler 15"]
[null,null,null,null,null,null,null,null,null,null,null,"Königin Rotigen 21"]
[null,null,null,null,null,null,null,null,null,null,null,"2 te Rotigen 20"]
[null,null,null,null,null,null,null,null,null,null,null,"Königin Rotigen 19"]
[null,null,null,null,null,null,null,null,null,null,null,"Königin Rotigen 18"]
[null,null,null,null,null,null,null,null,null,null,null,"3 te Rotigen 17"]
[null,null,null,null,null,null,null,null,null,null,null,"Königin V Rotigen 15"]
[8,"Creola",null,"Bregy Ralf & Adolf","Unterems",null,null,"2011-10-01","120.0935.2375.9","Dorina","$BREONA","3 te Rotigen 22","4 te I Goler 22"]
[null,null,null,null,null,null,null,null,null,null,null,"5 te Rotigen 21","Königin I Goler 19"]
[null,null,null,null,null,null,null,null,null,null,null,"6 te Rotigen 20","4 te IV Kantonal 15"]
[null,null,null,null,null,null,null,null,null,null,null,"5 te Rotigen 19","3 te V Goler 14"]
[null,null,null,null,null,null,null,null,null,null,null,"13 te Rotigen 18"]
[null,null,null,null,null,null,null,null,null,null,null,"12 te Rotigen 17"]
[null,null,null,null,null,null,null,null,null,null,null,"3 te V Rotigen 14"]
[9,"Coquette",null,"Bregy Ralf & Adolf","Unterems",null,null,"2016-10-01","120.1255.5043.2","Canaille","#ZIRO",null,"3 te I Aproz 23"]
[10,"Diabolo",null,"Bregy Anja","Unterems",null,null,"2014-10-01","120.0591.9312.5","Creola","#TEIRO","13 te Rotigen 22","Königin I Goler 22"]
[null,null,null,null,null,null,null,null,null,null,null,"13 te Rotigen 21","Königin Zweitm. Vifra 19"]
[null,null,null,null,null,null,null,null,null,null,null,"15 te Rotigen 20","4 te IV Martigny 18"]
[11,"Cashida",null,"Bregy Ralf & Adolf","Unterems",null,null,"2016-09-01","120.1255.5038.8","Clairon","$BREONA","13 te Rotigen 22","7 te II Aproz 22"]
[null,null,null,null,null,null,null,null,null,null,null,null,"2 te V Goler 19"]
[12,"Mirage",null,"Bregy Silvan & Patrick","Unterems","N","IV","2019-10-01","120.1469.3319.1","Milow","#CASINO","4 te V Zinal 22"]
[13,"Tonique",null,"Bregy Silvan & Patrick","Unterems",null,null,"2018-11-01","120.1255.5056.2","Tequilla","#CASINO","3 te IV Rotigen 22 (Gr. Kühe)"]
[null,null,null,null,null,null,null,null,null,null,null,"1 te V Zinal 21","3 te V Goler 21"]
[14,"Canabis",null,"Bregy Ralf & Adolf","Unterems",null,null,"2015-11-01","120.1255.5036.4","Canaille","@BISON","10 te Rotigen 22","2 te I Aproz 22"]
[null,null,null,null,null,null,null,null,null,null,null,null,"2 teIV Vifra 19"]
[15,"Catalina",null,"Bregy Uli, Lisi & Pascal","Ergisch",null,null,"2013-10-01","120.1050.6420.1","Caline","SHACARI",null,"6 te II Goler 19"]
[16,"Cataille",null,"Bregy Uli, Lisi & Pascal","Ergisch",null,null,"2018-12-01","120.1461.2271.7","Catalina","@PAGNOL",null,"6 te Zweitm. Vifra 23"]
[17,"Perona",null,"Bregy Uli, Lisi & Pascal","Ergisch",null,null,"2018-10-12","120.1394.8450.1","Pandora","Bandito",null,"4 te IV Goler 22"]
[18,"Xaphir",null,"Bregy Uli, Lisi & Pascal","Ergisch",null,null,"2015-10-01","120.1213.2629.1","Xenja","TOUAREG","5 te V Rotigen 18","3 te V Goler 18"]
[19,"Tiranie",null,"Bregy Uli, Lisi & Pascal","Ergisch",null,null,"2013-11-01","120.1121.4498.9","Tsatagne","ZOLA","Königin IV Vieux They 17","7 te III Goler 22"]
[20,"Tirana",null,"Bregy Uli, Lisi & Pascal","Ergisch","N","IV","2019-11-01","120.1531.4905.9","Tiranie","$Neron"]
[21,"Bora",null,"Bregy Uli, Lisi & Pascal","Ergisch",null,null,"2012-09-01","120.0999.4111.3","Bobino","@BIRK","10 te Rotigen 22"]
[null,null,null,null,null,null,null,null,null,null,null,"12 te Rotigen 20"]
[null,null,null,null,null,null,null,null,null,null,null,"12 te ZALAN D`AYENT 18"]
[22,"Baron",null,"Fam. Leiggener","Turtmann",null,null,"2016-01-01","120.1278.5681.5","Bijoux","$VITO",null,"6 te I Aproz 23"]
[null,null,null,null,null,null,null,null,null,null,null,null,"7 te I Haudéres 22"]
[null,null,null,null,null,null,null,null,null,null,null,null,"7 te I Goler 21"]
[23,"Colette",null,"Fam. Leiggener","Turtmann",null,null,"2018-11-23","120.1467.1536.0","Clochette","$Bello"]
[24,"Tirana",null,"Fam. Leiggener","Turtmann","N","IV","2019-11-01","120.1537.2531.4","Tigres","Pandor"]
[25,"Clochette",null,"Fam. Leiggener","Turtmann","N","IV","2019-11-01","120.1542.4866.9","Courgette","#MISTER"]
[26,"Calmy",null,"Fux W., J., & Wyer Piet","Eggerberg","N",null,"2015-10-01","120.1262.1659.7","Caprice","Vasco"]
[27,"Bolero",null,"Fux W., J., & Wyer Piet","Eggerberg",null,null,"2013-11-11","120.1119.8616.0","Baguera","TIGER"]
[28,"Poseidon",null,"Fux W., J., & Wyer Piet","Eggerberg","N","IV","2019-11-01","120.1530.6557.1","Pigalle","@FANGIO"]
[29,"Viva",null,"Fux W., J., & Wyer Piet","Eggerberg","N","IV","2019-11-01","120.1530.6556.4","Valaisanne","@FANGIO"]
[30,"Calimba",null,"Fux W., J., & Wyer Piet","Eggerberg",null,null,"2012-10-26","120.0994.6741.5","Clairon","#TORRES"]
[31,"Diamant",null,"Fux W., J., & Wyer Piet","Eggerberg",null,null,"2017-09-25","120.1330.7538.5","Dixence","@JENAL"]
[32,"Bacardi",null,"Fux W., J., & Wyer Piet","Eggerberg",null,null,"2014-10-01","120.1186.6938.7","Bataille","VASCO",null,"5 te III Goler 22"]
[null,null,null,null,null,null,null,null,null,null,null,null,"5 te Zweitm. Vifra 19"]
[33,"Mandalin",null,"Fux W., J., & Wyer Piet","Eggerberg",null,null,"2018-10-12","120.1460.7517.4","Mystic","@Berlusconi",null,"4 te V Zermatt 21"]
[34,"Toscana",null,"Fux W., J., & Wyer Piet","Eggerberg",null,null,"2014-10-01","120.1186.6939.4","Tarzan","TIGER",null,"Königin III Aproz 23"]
[null,null,null,null,null,null,null,null,null,null,null,null,"Königin V Vifra 17"]
[35,"Baquera",null,"Fux W., J., & Wyer Piet","Eggerberg",null,null,"2016-10-01","120.1273.8032.7","Bataille","CASANOVA",null,"7 te V Vifra 19"]
[36,"Soraya",null,"Gebrüder Jäger","Turtmann","N","IV","2019-09-01","120.1485.8532.9","Sultane","@REBEL"]
[37,"Tina",null,"Gebrüder Jäger","Turtmann",null,null,"2017-10-13","120.1300.6942.4","Tirana","@JENAL"]
[38,"Tango",null,"Gebrüder Jäger","Turtmann","N","IV","2019-10-01","120.1485.8536.7","Taylor","@PASCHA",null,"7 te IV Goler 22"]
[39,"Tokyo",null,"Gebrüder Jäger","Turtmann","N","IV","2019-10-01","120.1485.8533.6","Tiara","@BISON"]
[40,"Lorens",null,"Gebrüder Jäger","Turtmann",null,null,"2013-10-01","120.1118.9224.9","Micabol","MONZA","4 te Rotigen 22","3 te I Goler 22"]
[null,null,null,null,null,null,null,null,null,null,null,"9 te Rotigen 21","4 te IV Goler 17                                                           "]
[null,null,null,null,null,null,null,null,null,null,null,"8 te Rotigen 20"]
[41,"Simba",null,"Gebrüder Jäger","Turtmann",null,null,"2015-10-01","120.1153.2317.6","Sultane","$BOCASSA",null,"4 te IV Vifra 19"]
[null,null,null,null,null,null,null,null,null,null,null,null,"7 te V Zermatt 19"]
[42,"Tara",null,"Gebrüder Jäger","Turtmann",null,null,"2017-11-21","120.1395.5441.9","Taylor","#Picador"]
[43,"Tabea",null,"Gebrüder Jäger","Turtmann",null,null,"2018-11-13","120.1395.5453.2","Tango","#Santos"]
[44,"Alena",null,"Hischier H. & Bühlmann J.","Oberems","N",null,"2018-12-01","120.0674.5756.1","Adonis","@PAGNOL"]
[45,"Baghira",null,"Hischier H. & Bühlmann J.","Oberems","N",null,"2018-12-01","120.1404.2739.9","Jamanda","@PAGNOL"]
[46,"Pandora",null,"Hischier Pius","Unterems","N","IV","2019-12-01","120.1324.6176.9","Pablo","@PASCHA"]
[47,"Baghira",null,"Hischier Pius","Unterems","N","IV","2019-10-01","120.1460.7530.3","Baquera","@CLINTON"]
[48,"Pablo",null,"Hischier Pius","Unterems",null,null,"2013-12-01","120.0990.3391.7","Puma","$SATYR",null,"2 te II Goler 19"]
[49,"Pruedence",null,"Hischier Pius","Unterems",null,null,"2017-12-14","120.1324.6169.1","Pelila","@JENAL"]
[50,"Finet",null,"Familie Mussmann","Steg",null,null,"2017-12-25","120.1339.0200.1","Frimousse","@Disco"]
[51,"Santana",null,"Jäger Carlo","Turtmann","N","IV","2019-12-01","120.1541.4712.2","Sera","#PRINCE"," "]
[52,"Beline",null,"Jäger Carlo","Turtmann",null,null,"2018-10-30","120.1416.5725.2","Bataille","Bogosse",null,"7 te IV Goler 22"]
[53,"Bijou",null,"Jäger Carlo","Turtmann",null,null,"2018-12-17","120.1416.5733.7","Bandit","Bogosse"]
[54,"Madrid",null,"Jäger Carlo","Turtmann","N","IV","2019-11-01","120.1416.5744.3","Metis","Lennon"]
[55,"Flora",null,"Jäger Carlo","Turtmann",null,null,"2017-10-23","120.1335.1512.6","Fera","PERSOIS","3 te V Rotigen 20"]
[56,"Prunelle",null,"Jäger Carlo","Turtmann","N","IV","2019-11-01","120.1416.5743.6","Prune","@TIBURON"]
[57,"Sera",null,"Jäger Carlo","Turtmann",null,null,"2014-10-01","120.1151.1686.0","Brunette","ZETOR","5 te Rotigen 22"]
[null,null,null,null,null,null,null,null,null,null,null,"9 te Rotigen 21"]
[null,null,null,null,null,null,null,null,null,null,null,"11 te Rotigen 20"]
[null,null,null,null,null,null,null,null,null,null,null,"2 te IV Rotigen 18"]
[null,null,null,null,null,null,null,null,null,null,null,"3 te V Rotigen 17"]
[58,"Bataille",null,"Jäger Carlo","Turtmann","N",null,"2015-11-01","120.1228.8024.2","Bandit","Milou",null,"5 te IV Vifra 18"]
[59,"Tourmente",null,"Jäger Carlo","Turtmann","N","IV","2019-10-01","120.1416.5738.2","Taverne","#PRINCE"]
[60,"Megane",null,"Jäger Carlo","Turtmann",null,null,"2016-12-01","120.1335.1507.2","Mandolin","#PRIMUS"]
[61,"Metis",null,"Jäger Carlo","Turtmann",null,null,"2016-11-01","120.1335.1505.8","Mitis","#PRINCE",null,"Königin II Aproz 23"]
[62,"Samba",null,"Jäger Carlo","Turtmann",null,null,"2017-10-19","120.1335.1511.9","Sera","@BOCASSA","2 te Zweitmelken Rotigen 22"]
[63,"Baquerra",null,"Mathieu Sascha & Leander","Albinen","N","IV","2020-01-01","120.1407.8140.8","Belon","@TIBURON"]
[64,"Baghira",null,"Mathieu Sascha & Leander","Albinen",null,null,"2013-11-01","120.0931.3517.4","Bataille","@CATUS",null,"6 te IV Goler 17"]
[65,"Balea",null,"Mathieu Sascha & Leander","Albinen","N",null,"2017-11-01","120.1407.8122.4","Bavaria","@MARCIANO"]
[66,"Bluewin",null,"Mathieu Sascha & Leander","Albinen",null,null,"2018-12-05","120.1407.8130.9","Baronesse","@TIGROU"]
[67,"Barillo",null,"Mathieu Sascha & Leander","Albinen",null,null,"2017-12-01","120.1407.8123.1","Babylon","@MARCIANO"]
[68,"Tigresse",null,"Nicoriuc Ciprian","Arbaz","N",null,"2016-12-01","120.1343.4334.6","Tsering","@CASPER"]
[69,"Bonita",null,"Stallung Passeraub","Getwing",null,null,"2014-01-01","120.1118.4001.1","Bombache","MALI"]
[70,"Belana",null,"Stallung Passeraub","Getwing",null,null,"2018-10-10","120.1405.6860.3","Baghera","#FEDULOV","2 te IV Rotigen 22 (Gr. Kühe)"]
[null,null,null,null,null,null,null,null,null,null,null,"Königin V Rotigen 21"]
[71,"Beluga",null,"Stallung Passeraub","Getwing",null,null,"2018-10-10","120.1405.6861.0","Baghera","#FEDULOV","2 te V Rotigen 21"]
[72,"Boriana",null,"Stallung Passeraub","Getwing","N",null,"2018-10-01","120.1405.6865.8","Bonita","#FEDULOV"]
[73,"Briona",null,"Leiggener Sven & Joelle","Getwing","N",null,"2018-10-01","120.1405.6863.4","Bobino","Vivo",null,"4 te IV Goler 22"]
[74,"Bandera",null,"Stallung Passeraub","Getwing","N","IV","2019-12-01","120.1546.4961.9","Ballerine","#CALIMERO",null,"6 te IV Goler 23"]
[75,"Bolienne",null,"Stallung Passeraub","Getwing","N","IV","2019-11-01","120.1526.1438.1","Baghera","#CORBI"]
[76,"Pablo",null,"Hutter Richard","Lalden",null,null,"2016-11-04","120.1324.8848.3","Peluche","#CORBI"]
[77,"Beres",null,"Stallung Passeraub","Getwing",null,null,"2016-10-01","120.1327.2422.2","Belle","#CALIMERO","Königin V Rotigen 19"]
[78,"Ballerine",null,"Stallung Passeraub","Getwing",null,null,"2014-12-01","120.1188.5412.7","Bombache","CACTUS","6 te Rotigen 21","6 te IV Kantonal 18"]
[null,null,null,null,null,null,null,null,null,null,null,"Königin IV Rotigen 18","3 te IV Goler 18"]
[null,null,null,null,null,null,null,null,null,null,null,"Königin V Rotigen 17"]
[79,"Benschaby",null,"Stallung zum Stäg","St. Niklaus","N",null,"2018-12-01","120.1464.0313.7","Benika","@DONIZETTI"]
[80,"Canaille",null,"Stallung zum Stäg","St. Niklaus","N",null,"2018-10-01","120.1416.5722.1","Candice","Bogosse"]
[81,"Jachira",null,"Stallung zum Stäg","St. Niklaus","N",null,"2018-10-01","120.1410.3685.9","Janus","Zlatan"]
[82,"Cayenne",null,"Stallung zum Stäg","St. Niklaus",null,null,"2015-12-25","120.1258.8839.9","Chealsy","TAO"]
[83,"Tomba",null,"Tscherry E. & B.","Agarn","N",null,"2017-11-01","120.1349.1597.0","Tulip","@JENAL"]
[84,"Tutti",null,"Tscherry E. & B.","Agarn",null,"IV","2019-11-01","120.1541.8041.9","Tina","Salome"]
[85,"Vanessa",null,"Williner Anton","Visp",null,null,"2012-11-01","120.0955.4060.0","Vallesia","CHUCK","3 te IV Rotigen 16","2 te IV Goler 15"]
[86,"Tira",null,"Williner Anton","Visp",null,null,"2012-11-01","120.0955.4058.7","Tomba","CHUCK"]
[87,"Violine",null,"Williner Anton","Visp",null,null,"2016-12-01","120.1252.8373.6","Vivana","VANCOUVER"]
[88,"Tonic",null,"Williner Anton","Visp",null,null,"2017-10-25","120.1252.8388.0","Tara","VAMPIRE"]
[89,"Vivana",null,"Williner Anton","Visp",null,null,"2011-11-01","120.0923.7668.4","Violine","BEN","Königin Griebelalp 18"]
[null,null,null,null,null,null,null,null,null,null,null,"2 te Griebelalp 17"]
[null,null,null,null,null,null,null,null,null,null,null,"Königin IV Rotigen 15"]
[90,"Tigra",null,"Williner Anton","Visp",null,null,"2012-01-01","120.0955.4046.4","Tina","BEN","2 te Griebelalp 18"]
[null,null,null,null,null,null,null,null,null,null,null,"6 te Griebelalp 17"]
[null,null,null,null,null,null,null,null,null,null,null,"3 te IV Rotigen 15"]
[91,"Roquette",null,"Zumofen / Gattlen","Turtmann","N","IV","2019-11-01","120.1524.2753.0","Rocky","@PAGNOL"]
[92,"Rabiata",null,"Zumofen / Gattlen","Turtmann",null,null,"2018-10-13","120.1402.0667.3","Rambo","#CONCORDE","2 te IV Rotigen 22 (Gr. Kühe)"]
[93,"Bellissima",null,"Zumofen / Gattlen","Turtmann",null,null,"2018-09-14","120.1402.0666.6","Bellon","SABATA"]
[94,"Fakir",null,"Zumofen / Gattlen","Turtmann",null,null,"2018-11-08","120.1402.0672.7","Fatale","#ZIRO"]
[95,"Xea",null,"Zumofen / Gattlen","Turtmann",null,null,"2018-11-20","120.1402.0674.1","Xena","#CONCORDE",null,"5 te IV Vifra 22"]
[96,"Vania",null,"Zumofen / Gattlen","Turtmann","N","IV","2019-11-01","120.1525.0484.2","Violin","#VILAR"]
[97,"Violette",null,"Zumofen / Gattlen","Turtmann",null,null,"2015-09-01","120.1201.9782.3","Volero","$BREONA"]
[98,"Rena",null,"Zumofen / Gattlen","Turtmann",null,null,"2016-01-01","120.1269.9552.2","Ruby","@CARIBOU","14 te Rotigen 22","5 te I Goler 23"]
[99,"Maya",null,"Zumofen / Gattlen","Turtmann",null,null,"2016-12-01","120.1269.9561.4","Milou","#TORRO"]
[100,"Palona",null,"Zumofen / Gattlen","Turtmann",null,null,"2015-10-23","120.1201.9787.8","Papillon","#CAPO"]
[101,"Pinoccio",null,"Zumofen / Gattlen","Turtmann",null,null,"2016-10-01","120.1269.9557.7","Pengal","FIGGEBENGEL"]
[102,"Victoire",null,"Zumofen / Gattlen","Turtmann",null,null,"2015-10-10","120.1196.8739.7","Souris","#CAPO",null,"Königin II Aproz 23"]
[null,null,null,null,null,null,null,null,null,null,null,null,"6 te Goler 19"]
[103,"Xena",null,"Zumofen / Gattlen","Turtmann",null,null,"2012-10-01","120.1051.2928.3","Xenti","@CARIBOU","Königin Rotigen 22"]
[null,null,null,null,null,null,null,null,null,null,null,"3 te Rotigen 21"]
[null,null,null,null,null,null,null,null,null,null,null,"2 te Rotigen 20"]
[null,null,null,null,null,null,null,null,null,null,null,"3 te Rotigen 19"]
[104,"Rigolo",null,"Zumofen / Gattlen","Turtmann",null,null,"2016-10-01","120.1269.9554.6","Rocky","$BREONA",null,"4 te II Aproz 23"]
[105,"Xana",null,"Zumofen / Gattlen","Turtmann",null,null,"2017-12-11","120.1402.0663.5","Xena","#MARSAL"]
[]
["Bemerkung: Bei Fux W., J., & Wyer Piet 2 Gruppen, deshalb 2 Trupposiegerinnen"]
[]
["Viel Vergnügen und spannende Kämpfe wünscht die Alpgenossenschaft Turtmanntal und die Bestosser der Alpe Rotigen"]
[null,null,null,null,null,null,null,null,null,null,null,null,"© Alpe Rotigen"]

{"sheet":"2022","index":5,"n_rows":165,"n_cols":13,"rows_kept":165,"cut":false,"hidden":false,"merged":[[145,0,147,0],[145,1,147,1],[145,7,147,7],[125,10,127,10],[128,0,130,0],[128,1,130,1],[128,3,130,3],[128,4,130,4],[128,7,130,7],[128,8,130,8],[128,9,130,9],[128,10,130,10],[108,8,109,8],[108,9,109,9],[108,10,109,10],[125,0,127,0],[125,1,127,1],[125,3,127,3],[125,4,127,4],[125,7,127,7],[125,8,127,8],[125,9,127,9],[108,0,109,0],[108,1,109,1],[108,3,109,3],[108,4,109,4],[108,7,109,7],[69,8,70,8],[69,9,70,9],[69,10,70,10],[92,1,94,1],[92,4,94,4],[92,7,94,7],[69,0,70,0],[69,1,70,1],[69,3,70,3],[69,4,70,4],[69,7,70,7],[46,7,47,7],[46,8,47,8],[46,9,47,9],[46,10,47,10],[58,0,59,0],[58,1,59,1],[58,3,59,3],[58,4,59,4],[58,7,59,7],[58,8,59,8],[46,4,47,4],[58,9,59,9],[58,10,59,10],[43,0,45,0],[43,1,45,1],[46,0,47,0],[46,1,47,1],[46,3,47,3],[35,8,36,8],[35,9,36,9],[35,10,36,10],[31,0,34,0],[31,1,34,1],[31,3,34,3],[31,4,34,4],[35,0,36,0],[35,1,36,1],[35,3,36,3],[35,4,36,4],[35,7,36,7],[31,7,34,7],[31,8,34,8],[31,9,34,9],[31,10,34,10],[28,0,29,0],[28,1,29,1],[28,3,29,3],[28,4,29,4],[28,7,29,7],[17,0,21,0],[17,1,21,1],[17,3,21,3],[17,4,21,4],[17,7,21,7],[22,0,26,0],[22,1,26,1],[22,3,26,3],[22,4,26,4],[22,7,26,7],[17,8,21,8],[32,12,34,12],[17,9,21,9],[17,10,21,10],[18,12,21,12],[22,8,26,8],[22,9,26,9],[22,10,26,10],[23,12,26,12],[28,8,29,8],[28,9,29,9],[28,10,29,10],[28,11,29,11]]}
["Alpe Rotigen Turtmanntal"]
[]
["Alpaufzug vom xx Juni 2022"]
[]
[null,null,null,"Trupposiegerin",124,null,null,"Tiere",null,null,"Klassiert 2021 und nicht da"]
[]
[null,null,null,"Klassiert 2021",25,null,"IV","Erstmelken",null,null,"Flacari, Bregy Ralf und Adolf (7em)"]
[]
[null,null,null,null,36,null,"N","Neu (Nicht da 2020)"]
[]
["Nr.","Name",null,"Besitzer","Ort",null,null,"Geb.","BDTA","Mutter","Vater","Klassierungen Alpe","Klassierungen Match"]
[1,"Venus",null,"Bayard Medard & Gustav","N'Gampel",null,null,"2014-11-01","120.0618.4532.6","Violette","@MAC"]
[2,"Fantastic",null,"Bayard Medard & Gustav","N'Gampel",null,null,"2015-12-01","120.1201.9792.2","Chinook","#CAPO","4te IV Rotigen 19"]
[3,"Priska",null,"Bayard Medard & Gustav","N'Gampel",null,null,"2015-11-01","120.0618.4540.1","Pinka","@MELCHIOR","3te IV Rotigen 19"]
[4,"Vampir",null,"Bayard Medard & Gustav","N'Gampel",null,null,"2015-10-01","120.0618.4536.4","Violette","@MELCHIOR"]
[5,"Pandera",null,"Bayard Medard & Gustav","N'Gampel",null,null,"2014-12-01","120.0618.4534.0","Pinka","PRINZ"]
[6,"Flacabre",null,"Bregy Ralf & Adolf","Unterems",null,null,"2016-10-01","120.1255.5039.5","Flacari","$BREONA"]
[7,"Canaille",null,"Bregy Ralf & Adolf","Unterems",null,null,"2012-10-01","120.0931.3322.4","Chealsy","$BREONA","2te Rotigen 20"]
[null,null,null,null,null,null,null,null,null,null,null,"Königin Rotigen 19","4te V Goler 15"]
[null,null,null,null,null,null,null,null,null,null,null,"Königin Rotigen 18"]
[null,null,null,null,null,null,null,null,null,null,null,"3te Rotigen 17"]
[null,null,null,null,null,null,null,null,null,null,null,"Königin V Rotigen 15"]
[8,"Creola",null,"Bregy Ralf & Adolf","Unterems",null,null,"2011-10-01","120.0935.2375.9","Dorina","$BREONA","6te Rotigen 20"]
[null,null,null,null,null,null,null,null,null,null,null,"5te Rotigen 19","Königin I Goler 19           \n4te IV Kantonal 15       \n3te V Goler 14"]
[null,null,null,null,null,null,null,null,null,null,null,"13te Rotigen 18"]
[null,null,null,null,null,null,null,null,null,null,null,"12te Rotigen 17"]
[null,null,null,null,null,null,null,null,null,null,null,"3te Rotigen 14"]
[9,"Coquette",null,"Bregy Ralf & Adolf","Unterems",null,null,"2016-10-01","120.1255.5043.2","Canaille","#ZIRO"]
[10,"Diabolo",null,"Bregy Ralf & Adolf","Unterems",null,null,"2014-10-01","120.0708.9312.7","Creola","#TEIRO","15te Rotigen 20","Königin  Zweitmelken Vifra 19"]
[null,null,null,null,null,null,null,null,null,null,null,null,"4te IV Martigny 18"]
[11,"Carcas",null,"Bregy Ralf & Adolf","Unterems",null,null,"2016-10-01","120.1255.5041.8","Cartouche","#CASINO",null,"Königin V Goler 19"]
[12,"Milow",null,"Bregy Silvan & Patrik","Unterems",null,null,"2011-09-01","120.0931.3304.0","Maruschka","$BREONA","6te Rotigen 20"]
[null,null,null,null,null,null,null,null,null,null,null,"6te Rotigen 19","5te II Goler 18             \n2te V Goler 14"]
[null,null,null,null,null,null,null,null,null,null,null,"4te Rotigen 18"]
[null,null,null,null,null,null,null,null,null,null,null,"13te Rotigen 17"]
[13,"Tequilla",null,"Bregy Silvan & Patrik","Unterems",null,null,"2012-12-01","120.0931.3329.3","Tragonja","#TEIRO","10te Rotigen 20"]
[null,null,null,null,null,null,null,null,null,null,null,"11te Rotigen 19"]
[14,"Canabis",null,"Bregy Ralf & Adolf","Unterems",null,null,"2015-11-01","120.1255.5036.4","Canaille","@BISON",null,"2te IV Vifta 19"]
[15,"Cashida",null,"Bregy Ralf & Adolf","Unterems",null,null,"2016-09-01","120.1255.5038.8","Clairon","$BREONA",null,"2te V Goler 19"]
[16,"Murphy",null,"Bregy Uli / Lisi & Pasci","Ergisch",null,null,"2016-12-01","120.1329.8033.8","Manga","@FAKIR"]
[17,"Simba",null,"Bregy Uli / Lisi & Pasci","Ergisch","N","IV","2017-12-10","120.1394.8447.1","Souki","LOUKY"]
[18,"Souki",null,"Bregy Uli / Lisi & Pasci","Ergisch",null,null,"2009-10-01","120.0745.7355.1","Mirage","COQUIN","13te Rotigen 20"]
[19,"Tiranie",null,"Bregy Uli / Lisi & Pasci","Ergisch",null,null,"2013-11-01","120.1121.4498.9","Tsatagne","ZOLA","Königin IV Vieux They 17"]
[20,"Caline",null,null,null,null,null,null,null,null,null,"10te Rotigen 20"]
[null,null,null," Bregy Uli / Lisi & Pasci","Ergisch",null,null,"2010-10-01","120.0919.1804.5","Calimero","$BOCASSA","14te Rotigen 19","3te IV Goler 14"]
[null,null,null,null,null,null,null,null,null,null,null,"4te V Rotigen 13","3te V Goler 13"]
[21,"Bora",null,"Bregy Uli / Lisi & Pasci","Ergisch",null,null,"2012-09-01","120.0999.4111.3","Bobino","@BIRK","12te Rotigen 20"]
[null,null,null,null,null,null,null,null,null,null,null,"12te ZALAN D`AYENT 18"]
[22,"Xaphir",null,"Bregy Uli / Lisi & Pasci","Ergisch",null,null,"2015-10-01","120.1213.2629.1","Xenja","TOUAREG","5te V Rotigen 18","3te V Goler 18"]
[23,"Corona",null,"Bregy Uli / Lisi & Pasci","Ergisch",null,null,"2016-10-01","120.1249.2515.6","Cobra","CASSIUS"]
[24,"Catalina",null,"Bregy Uli / Lisi & Pasci","Ergisch",null,null,"2013-10-01","120.1050.6420.1","Caline","SHACARI",null,"6te II Goler 19"]
[25,"Calette",null,"Bregy Uli / Lisi & Pasci","Ergisch",null,null,"2016-11-01","120.1328.6981.7","Caprice","@FAKIR"]
[26,"Cataleya",null,"Bregy Uli / Lisi & Pasci","Ergisch",null,null,"2016-11-01","120.1320.9486.8","Caline","$JAKARI"]
[27,"Rebell",null,"Fam. Leiggener","Turtmann",null,null,"2010-09-01","120.0761.3757.7","Riva","@BIRK",null,"5te II Goler 16"]
[28,"Baron",null,"Fam. Leiggener","Turtmann",null,null,"2016-01-01","120.1278.5681.5","Bijoux","$VITO"]
[29,"Bolero",null,"Fux W., J., & Wyer Piet","Eggerberg","N",null,"2013-11-11","120.1119.8616.0","Baguera","TIGER"]
[30,"Diamant",null,"Fux W., J., & Wyer Piet","Eggerberg","N","IV","2017-09-25","120.1330.7538.5","Dixence","@JENAL"]
[31,"Bastis",null,"Fux W., J., & Wyer Piet","Eggerberg","N","IV","2017-10-16","120.1291.2700.5","Bataille","#TURCO"]
[32,"Mystic",null,"Fux W., J., & Wyer Piet","Eggerberg",null,null,"2012-10-01","120.0995.2546.7","Etoile","MAGIC",null,"6te IV Goler 16"]
[null,null,null,null,null,null,null,null,null,null,null,null,"3te III Goler 18"]
[33,"Baquera",null,"Fux W., J., & Wyer Piet","Eggerberg",null,null,"2016-10-01","120.1273.8032.7","Bataille","CASANOVA"]
[34,"Valaisanne",null,"Fux W., J., & Wyer Piet","Eggerberg",null,null,"2015-01-01","120.1186.6943.1","Vagabonde","VAMPIR"]
[35,"Pampère",null,"Fux W., J., & Wyer Piet","Eggerberg",null,null,"2016-10-01","120.1273.8034.1","Pigalle","CASANOVA"]
[36,"Calmy",null,"Fux W., J., & Wyer Piet","Eggerberg",null,null,"2015-10-01","120.1262.1659.7","Caprice","VASCO"]
[37,"Toscana",null,"Fux W., J., & Wyer Piet","Eggerberg",null,null,"2014-10-01","120.1186.6939.4","Tarzan","TIGER",null,"Königin V Vifra 17"]
[38,"Bresil",null,"Fux W., J., & Wyer Piet","Eggerberg",null,null,"2013-01-01","120.1055.7163.1","Afifa","#TORRES"]
[39,"Bacardi",null,"Fux W., J., & Wyer Piet","Eggerberg",null,null,"2014-10-01","120.1186.6938.7","Bataille","VASCO",null,"5te Zweitmelken Vifra 19"]
[40,"Tina",null,"Gebrüder Jäger","Turtmann","N","IV","2017-10-13","120.1300.6942.4","Tirana","@JENAL"]
[41,"Tara",null,"Gebrüder Jäger","Turtmann","N","IV","2017-11-21","120.1395.5441.9","Taylor","#PICADOR"]
[42,"Simba",null,"Gebrüder Jäger","Turtmann",null,null,"2015-10-01","120.1153.2317.6","Sultane","$BOCASSA",null,"4te IV Vifra 19"]
[null,null,null,null,null,null,null,null,null,null,null,null,"7te V Zermatt 19"]
[43,"Dorina",null,"Gebrüder Jäger","Turtmann",null,null,"2014-11-01","120.1153.2313.8","Dijone","#KEIRO",null,"6te Zweitmelken Vifra 19"]
[44,"Tiara",null,"Gebrüder Jäger","Turtmann",null,null,"2015-11-01","120.1258.5634.3","Tokyo","$STARTUFF"]
[45,"Tanja",null,"Gebrüder Jäger","Turtmann",null,null,"2016-11-01","120.1258.5641.1","Tango","$PECKER"]
[46,"Lorens",null,"Gebrüder Jäger","Turtmann",null,null,"2013-10-01","120.1118.9224.9","Micabol","MONZA","8te Rotigen 20","4te IV Goler 17"]
[47,"Lenja",null,"Hischier H. & Bühlmann J.","Oberems",null,null,"2015-11-01","120.1197.2405.4","Lana","#CARNAVAL"]
[48,"Jamada",null,"Hischier H. & Bühlmann J.","Oberems",null,null,"2014-12-01","120.1202.2001.9","Janis","@GLOU-GLOU"]
[49,"Gina-Lisa",null,"Hischier Pius","Unterems","N","IV","2017-11-07","120.1324.6168.4","Gloria","$CARNAGE"]
[50,"Pruedence",null,"Hischier Pius","Unterems","N","IV","2017-12-01","120.1324.6169","Pelila","@Jenal"]
[51,"Safira",null,"Hischier Pius","Unterems",null,null,"2015-10-01","120.1188.2113.6","Safira","@BISOTTO"]
[52,"Pablo",null,"Hischier Pius","Unterems",null,null,"2013-12-01","120.0990.3391.7","Puma","$SATYR",null,"2te II Goler 19"]
[53,"Caline",null,"Jäger Carlo","Turtmann","N","IV","2017-10-24","120.1335.1513.3","Cobra","$BOCASSA"]
[54,"Flora",null,"Jäger Carlo","Turtmann","N","IV","2017-10-23","120.1335.1512.6","Fera","PERSEUS","3te V Rotigen 20"]
[55,"Mesagne",null,"Jäger Carlo","Turtmann","N","IV","2017-10-29","120.1335.1516.4","Maila","#PRIMUS","Königin V Rotigen 20"]
[56,"Mygale",null,"Jäger Carlo","Turtmann","N","IV","2017-12-08","120.1335.1522.5","Mascotte","#PRINCE"]
[57,"Prune",null,"Jäger Carlo","Turtmann","N",null,"2016-11-25","120.1335.1504.1","Promise","NEGUS"]
[58,"Bataille",null,"Jäger Carlo","Turtmann",null,null,"2015-11-01","120.1228.8024.2","Bandit","MILOU",null,"5te V Vifra 18"]
[59,"Samba",null,"Jäger Carlo","Turtmann","N","IV","2017-10-19","120.1335.1511.9","Sera","@BOCASSA"]
[60,"Bayonne",null,"Jäger Carlo","Turtmann",null,null,"2015-10-01","120.1228.8022.8","Barlette","MILOU"]
[61,"Grolla",null,"Jäger Carlo","Turtmann",null,null,"2016-09-01","120.1228.8029.7","Gitane","#PRINCE"]
[62,"Megane",null,"Jäger Carlo","Turtmann",null,null,"2016-12-01","120.1335.1507.2","Mandolin","#PRIMUS"]
[63,"Metis",null,"Jäger Carlo","Turtmann",null,null,"2016-11-01","120.1335.1505.8","Mitis","#PRINCE"]
[null,"Sera",null,null,"Turtmann",null,null,"2014-10-01",null,null,null,"11te Rotigen 20"]
[64,null,null,"Jäger Carlo",null,null,null,null,"120.1151.1686.0","Brunette","ZETOR","2te IV Rotigen 18"]
[null,null,null,null,null,null,null,null,null,null,null,"3te V Rotigen 17"]
[65,"Pivoine",null,"Jäger Carlo","Turtmann",null,null,"2016-12-01","120.1333.7067.1","Princesse","@COQUIN 64"]
[66,"Taverne",null,"Jäger Carlo","Turtmann",null,null,"2016-10-01","120.1270.2454.2","Tina","@CERVIN"]
[67,"Tokio",null,"Jäger Carlo","Turtmann",null,null,"2015-10-01","120.1151.1700.3","Tigresse","MILOU","Königin IV Rotigen 19"]
[68,"Baghira",null,"Mathieu Leander & Sascha","Albinen",null,null,"2013-11-01","120.0931.3517.4","Bataille","@CATUS",null,"6e IV Goler 17t"]
[89,"Bavaria",null,"Mathieu Leander & Sascha","Albinen",null,null,"2012-10-01","120.0930.1107.2","Boa","$TARTUFF"]
[70,"Bonita",null,"Mathieu Leander & Sascha","Albinen",null,null,"2012-10-01","120.0930.1109.6","Belon","$VITO"]
[71,"Balea",null,"Mathieu Leander & Sascha","Albinen","N","IV","2017-11-01","120.1407.8122.4","Bavaria","@MARCIANO"]
[72,"Babylon",null,"Mathieu Leander & Sascha","Albinen",null,null,"2014-12-01","120.1201.2202.3","Barillo","SHACARI",null,"2te IV Goler 18"]
[73,"Bajka",null,"Stallung Passeraub","Getwing","N","IV","2017-10-23","120.1327.2436.9","Ballerine ","$TONUS"]
[74,"Beryl",null,"Stallung Passeraub","Getwing","N","IV","2017-09-17","120.1327.2440.6","Bobino","$TWISTER"]
[75,"Menance",null,"Stallung Passeraub","Getwing","N","IV","2017-10-22","120.1327.2435.2","Medusa","@CARIBOU"]
[76,"Pablo",null,"Hutter Richard ","Lalden","N",null,"2016-11-04","120.1324.8848.3","Peluche","#CORBI"]
[77,"Beres",null,"Stallung Passeraub","Getwing",null,null,"2016-10-01","120.1327.2422.2","Belle","#CALIMERO","Königin V Rotigen 19"]
[78,"Ballerine",null,"Stallung Passeraub","Getwing",null,null,"2014-12-01","120.1188.5412.7","Bombache","CACTUS","Königin IV Rotigen 18","6te IV Kantonal 18"]
[null,null,null,null,null,null,null,null,null,null,null,"Königin V Rotigen 17","3te IV Goler 18"]
[79,"Marla",null,"Stallung Passeraub","Getwing",null,null,"2016-09-01","120.1327.2424.6","Mochita","#CORBI"]
[80,"Bonita",null,"Stallung Passeraub","Getwing",null,null,"2014-01-01","1201118.4001.1","Bombache","MALI"]
[81,"Fägär",null,"Hutter Richard","Lalden",null,null,"2016-09-01","120.1327.2427.7","Fortuna","$TWISTER"]
[82,"Bobino",null,"Stallung Passeraub","Getwing",null,null,"2013-11-01","120.1118.4000.4","Berenice","#NAT"]
[83,"Cayenne",null,"Stallung zum Stäg","St. Niklaus","N",null,"2015-12-25","120.1258.8839.9","Chealsy","TAO"]
[84,"Santana",null,"Stallung zum Stäg","St. Niklaus","N",null,"2012-11-08","120.0995.8303.0","Samanta","$VITO",null,"2te V Sembrancher 15\n2te V Final Nat "]
[85,"Samantha",null,"Sewer R. & Thommen S.","Turtmann","N","IV","2017-10-18","120.1330.9651.9","Saphira","@Jenal"]
[86,"Tessa",null,"Sewer R. & Thommen S.","Turtmann","N","IV","2017-11-04","120.1324.5082.4","Tacona","#VILAR"]
[87,"Tiara",null,"Sewer R. & Thommen S.","Susten",null,null,"2012-11-01","120.0924.5773.4","Track","@LUCA",null,"7te III Goler 18"]
[88,"Malice",null,"Sewer R. & Thommen S.","Susten",null,null,"2015-11-01","120.0618.4544.9","Mirage","@MELCHIOR",null,"7te IV Goler 19"]
[89,"Biscot",null,"Sewer R. & Thommen S.","Susten",null,null,"2015-11-01","120.1255.5712.7","Bobino","POUDRE"]
[90,"Bolera",null,"Sewer R. & Thommen S.","Susten",null,null,"2015-10-01","120.1188.0914.1","Bango","FABIUS-FAROUK","4te V Rotigen 18"]
[91,"Carolin",null,"Tscherry Erwin & Bernhard","Agarn",null,null,"2014-09-01","120.1086.2394.8","Cuba","@NOUNOURS"]
[92,"Tomba",null,"Tscherry Erwin & Bernhard","Agarn","N","IV","2017-11-04","120.1349.1597.0","Tulip","@JENAL"]
[93,"Tonic",null,"Williner Anton","Visp","N","IV","2017-10-25","120.1252.8388.0","Tara","VAMPIRE"]
[94,"Tigra",null,"Williner Anton","Visp",null,null,"2012-01-01","120.0955.4046.4","Tina","BEN","2te Griebelalp 18"]
[null,null,null,null,null,null,null,null,null,null,null,"6te Griebelalp 17"]
[null,null,null,null,null,null,null,null,null,null,null,"2te IV Rotigen 15"]
[95,"Vivana",null,"Williner Anton","Visp",null,null,"2011-11-01","120.0923.7668.4","Violine","BEN","Königin Griebelalp 18"]
[null,null,null,null,null,null,null,null,null,null,null,"2te Griebelalp 17"]
[null,null,null,null,null,null,null,null,null,null,null,"Königin IV Rotigen 15"]
[96,"Vanessa",null,"Williner Anton","Visp",null,null,"2012-11-01","120.0955.4060.0","Vallesia","CHUCK","3te IV Rotigen 16","2te IV Goler 15"]
[97,"Violine",null,"Williner Anton","Visp","N",null,"2016-12-01","120.1252.8373.6","Vivana","VANCOUVER"]
[98,"Tira",null,"Williner Anton","Visp",null,null,"2012-11-01","120.0955.4058.7","Tomba","CHUCK"]
[99,"Rijana",null,"Wyssen Diego & Madlen","Susten","N","IV","2017-10-20","120.1399.9203.7","Ranja","PALADIN"]
[100,"Xantara",null,"Wyssen Diego & Madlen","Susten","N","IV","2017-10-05","120.1330.2483.3","Xera","#TURBULENCE"]
[101,"Xandria",null,"Wyssen Diego & Madlen","Susten",null,null,"2015-11-01","120.1256.8890.6","Xenja","#TORRO"]
[102,"Rasta",null,"Wyssen Diego & Madlen","Susten",null,null,"2015-11-01","120.1256.8888.3","Ranja","#TORRO"]
[103,"Xena",null,"Wyssen Diego & Madlen","Susten",null,null,"2013-11-01","120.1118.6566.3","Xera","FOUDRE","7et V Rotigen 16"]
[104,"Xhyla",null,"Wyssen Diego & Madlen","Susten",null,null,"2014-10-01","120.1127.8750.6","Xenia","#TURBULENCE","4te V Rotigen 17"]
[105,"Corona",null,"Zumoberhaus Pius","Oberwald","N",null,"2016-10-21","120.1258.8840.5","Coucou","@NEYMAR"]
[106,"Miss",null,"Zumoberhaus Pius","Oberwald","N",null,"2016-11-22","120.1331.0291.3","Milka","MILO"]
[107,"Violin",null,"Zumofen / Gattlen","Turtmann",null,null,"2013-11-01","120.0708.7752.3","Volero","$VITUS",null,"3te Zweitmelken Vifra 18"]
[108,"Violette",null,"Zumofen / Gattlen","Turtmann",null,null,"2015-09-01","120.1201.9782.3","Volero","$BREONA"]
[109,"Rena",null,"Zumofen / Gattlen","Turtmann",null,null,"2016-01-01","120.1269.9552.2","Ruby","@CARIBOU"]
[110,"Xena",null,null,null,null,null,"2012-10-01",null,null,null,"2te Rotigen 20"]
[null,null,null,"Zumofen / Gattlen","Turtmann",null,null,null,"120.1051.2928.3","Xenti","@CARIBOU","3te Rotigen 19"]
[null,null,null,null,null,null,null,null,null,null,null,"4te Rotigen 18"]
[111,"Palona",null,"Zumofen / Gattlen","Turtmann","N",null,"2015-10-23","120.1201.9787.8","Papillon","#CAPO"]
[112,"Riva",null,"Zimmermann Ivan & Monika","Getwing",null,null,"2015-10-01","120.1201.9784.7","Rocky","#CAPO"]
[113,"Vanda",null,"Zumofen / Gattlen","Turtmann",null,null,"2015-09-01","120.1201.9781.6","Volero","$BREONA"]
[114,"Maya",null,"Zumofen / Gattlen","Turtmann",null,null,"2016-12-01","120.1269.9561.4","Milou","#TORRO"]
[115,"Souris",null,"Zumofen / Gattlen","Turtmann","N",null,"2015-10-10","120.1196.8739.7","Souris","#CAPO"]
[116,"Pinoccio",null,"Zumofen / Gattlen","Turtmann",null,null,"2016-10-01","120.1269.9557.7","Pengal","FIGGEBENGEL"]
[117,"Rigolo",null,"Zumofen / Gattlen","Turtmann",null,null,"2016-10-01","120.1269.9554.6","Rocky","$BREONA"]
[118,"Vesuv",null,"Zumofen / Gattlen","Turtmann",null,null,"2016-11-01","120.1269.9558.4","Volero","#TORRO"]
[119,"Fayola",null,"Zumofen / Gattlen","Turtmann",null,null,"2014-09-01","120.0708.7750.9","Fiorenza","#VOLERIO","11te Rotigen 20"]
[120,"Rambo",null,"Zumofen / Gattlen","Turtmann",null,null,"2014-09-01","120.0708.7749.3","Rocky","#VOLERIO"]
[121,"Raja",null,"Zumofen / Gattlen","Turtmann","N","IV","2017-11-07","120.1402.0657.4","Rocky","#MARSAL"]
[122,"Xana",null,"Zumofen / Gattlen","Turtmann","N","IV","2017-12-11","120.1402.0663.5","Xena","#MARSAL"]
[123,"Fachita",null,"Zumofen / Gattlen","Turtmann","N","IV","2017-11-23","120.1402.0661.1","Fanjo","#MARSAL"]
[124,"Xara",null,"Zumofen / Gattlen","Turtmann","N",null,"2017-01-06","120.1269.9563.8","Xena","#TORRO"]
[null,null,null,null,null,null,null,null,null,null," "]
[]
["Viel Vergnügen wünschen die Alpgenossenschaft Turtmanntal und die Bestosser der Alpe Rotigen"]

{"sheet":"2021","index":6,"n_rows":138,"n_cols":13,"rows_kept":138,"cut":false,"hidden":false,"merged":[]}
["Alpe Rotigen Turtmanntal"]
[]
["Alpaufzug vom 19. Juni 2021"]
[]
[null,null,null,"Trupposiegerin",124,null,null,"Tiere",null,null,"Klassiert 2020 und nicht da"]
[]
[null,null,null,"Klassiert 2020",25,null,"IV","Erstmelken",null,null,"Flacari, Bregy Ralf und Adolf (7em)"]
[]
[null,null,null,null,36,null,"N","Neu (Nicht da 2020)"]
[]
["Nr.","Name",null,"Besitzer","Ort",null,null,"Geb.","BDTA","Mutter","Vater","Klassierungen Alpe","Klassierungen Match"]
[1,"Venus",null,"Bayard Medard & Gustav","N'Gampel",null,null,"2014-11-01","120.0618.4532.6","Violette","@MAC"]
[2,"Fantastic",null,"Bayard Medard & Gustav","N'Gampel",null,null,"2015-12-01","120.1201.9792.2","Chinook","#CAPO","4te IV Rotigen 19"]
[3,"Priska",null,"Bayard Medard & Gustav","N'Gampel",null,null,"2015-11-01","120.0618.4540.1","Pinka","@MELCHIOR","3te IV Rotigen 19"]
[4,"Vampir",null,"Bayard Medard & Gustav","N'Gampel",null,null,"2015-10-01","120.0618.4536.4","Violette","@MELCHIOR"]
[5,"Pandera",null,"Bayard Medard & Gustav","N'Gampel",null,null,"2014-12-01","120.0618.4534.0","Pinka","PRINZ"]
[6,"Flacabre",null,"Bregy Ralf & Adolf","Unterems",null,null,"2016-10-01","120.1255.5039.5","Flacari","$BREONA"]
[7,"Canaille",null,"Bregy Ralf & Adolf","Unterems",null,null,"2012-10-01","120.0931.3322.4","Chealsy","$BREONA","2te Rotigen 20"]
[8,"Creola",null,"Bregy Ralf & Adolf","Unterems",null,null,"2011-10-01","120.0935.2375.9","Dorina","$BREONA","6te Rotigen 20"]
[9,"Coquette",null,"Bregy Ralf & Adolf","Unterems",null,null,"2016-10-01","120.1255.5043.2","Canaille","#ZIRO"]
[10,"Diabolo",null,"Bregy Ralf & Adolf","Unterems",null,null,"2014-10-01","120.0708.9312.7","Creola","#TEIRO","15te Rotigen 20","Königin  Zweitmelken Vifra 19"]
[11,"Carcas",null,"Bregy Ralf & Adolf","Unterems",null,null,"2016-10-01","120.1255.5041.8","Cartouche","#CASINO",null,"Königin V Goler 19"]
[12,"Milow",null,"Bregy Silvan & Patrik","Unterems",null,null,"2011-09-01","120.0931.3304.0","Maruschka","$BREONA","6te Rotigen 20"]
[13,"Tequilla",null,"Bregy Silvan & Patrik","Unterems",null,null,"2012-12-01","120.0931.3329.3","Tragonja","#TEIRO","10te Rotigen 20"]
[14,"Canabis",null,"Bregy Ralf & Adolf","Unterems",null,null,"2015-11-01","120.1255.5036.4","Canaille","@BISON",null,"2te IV Vifta 19"]
[15,"Cashida",null,"Bregy Ralf & Adolf","Unterems",null,null,"2016-09-01","120.1255.5038.8","Clairon","$BREONA",null,"2te V Goler 19"]
[16,"Murphy",null,"Bregy Uli / Lisi & Pasci","Ergisch",null,null,"2016-12-01","120.1329.8033.8","Manga","@FAKIR"]
[17,"Simba",null,"Bregy Uli / Lisi & Pasci","Ergisch","N","IV","2017-12-10","120.1394.8447.1","Souki","LOUKY"]
[18,"Souki",null,"Bregy Uli / Lisi & Pasci","Ergisch",null,null,"2009-10-01","120.0745.7355.1","Mirage","COQUIN","13te Rotigen 20"]
[19,"Tiranie",null,"Bregy Uli / Lisi & Pasci","Ergisch",null,null,"2013-11-01","120.1121.4498.9","Tsatagne","ZOLA","Königin IV Vieux They 17"]
[20,"Caline",null," Bregy Uli / Lisi & Pasci","Ergisch",null,null,"2010-10-01","120.0919.1804.5","Calimero","$BOCASSA","10te Rotigen 20"]
[21,"Bora",null,"Bregy Uli / Lisi & Pasci","Ergisch",null,null,"2012-09-01","120.0999.4111.3","Bobino","@BIRK","12te Rotigen 20"]
[22,"Xaphir",null,"Bregy Uli / Lisi & Pasci","Ergisch",null,null,"2015-10-01","120.1213.2629.1","Xenja","TOUAREG","5te V Rotigen 18","3te V Goler 18"]
[23,"Corona",null,"Bregy Uli / Lisi & Pasci","Ergisch",null,null,"2016-10-01","120.1249.2515.6","Cobra","CASSIUS"]
[24,"Catalina",null,"Bregy Uli / Lisi & Pasci","Ergisch",null,null,"2013-10-01","120.1050.6420.1","Caline","SHACARI",null,"6te II Goler 19"]
[25,"Calette",null,"Bregy Uli / Lisi & Pasci","Ergisch",null,null,"2016-11-01","120.1328.6981.7","Caprice","@FAKIR"]
[26,"Cataleya",null,"Bregy Uli / Lisi & Pasci","Ergisch",null,null,"2016-11-01","120.1320.9486.8","Caline","$JAKARI"]
[27,"Rebell",null,"Fam. Leiggener","Turtmann",null,null,"2010-09-01","120.0761.3757.7","Riva","@BIRK",null,"5te II Goler 16"]
[28,"Baron",null,"Fam. Leiggener","Turtmann",null,null,"2016-01-01","120.1278.5681.5","Bijoux","$VITO"]
[29,"Bolero",null,"Fux W., J., & Wyer Piet","Eggerberg","N",null,"2013-11-11","120.1119.8616.0","Baguera","TIGER"]
[30,"Diamant",null,"Fux W., J., & Wyer Piet","Eggerberg","N","IV","2017-09-25","120.1330.7538.5","Dixence","@JENAL"]
[31,"Bastis",null,"Fux W., J., & Wyer Piet","Eggerberg","N","IV","2017-10-16","120.1291.2700.5","Bataille","#TURCO"]
[32,"Mystic",null,"Fux W., J., & Wyer Piet","Eggerberg",null,null,"2012-10-01","120.0995.2546.7","Etoile","MAGIC",null,"6te IV Goler 16"]
[33,"Baquera",null,"Fux W., J., & Wyer Piet","Eggerberg",null,null,"2016-10-01","120.1273.8032.7","Bataille","CASANOVA"]
[34,"Valaisanne",null,"Fux W., J., & Wyer Piet","Eggerberg",null,null,"2015-01-01","120.1186.6943.1","Vagabonde","VAMPIR"]
[35,"Pampère",null,"Fux W., J., & Wyer Piet","Eggerberg",null,null,"2016-10-01","120.1273.8034.1","Pigalle","CASANOVA"]
[36,"Calmy",null,"Fux W., J., & Wyer Piet","Eggerberg",null,null,"2015-10-01","120.1262.1659.7","Caprice","VASCO"]
[37,"Toscana",null,"Fux W., J., & Wyer Piet","Eggerberg",null,null,"2014-10-01","120.1186.6939.4","Tarzan","TIGER",null,"Königin V Vifra 17"]
[38,"Bresil",null,"Fux W., J., & Wyer Piet","Eggerberg",null,null,"2013-01-01","120.1055.7163.1","Afifa","#TORRES"]
[39,"Bacardi",null,"Fux W., J., & Wyer Piet","Eggerberg",null,null,"2014-10-01","120.1186.6938.7","Bataille","VASCO",null,"5te Zweitmelken Vifra 19"]
[40,"Tina",null,"Gebrüder Jäger","Turtmann","N","IV","2017-10-13","120.1300.6942.4","Tirana","@JENAL"]
[41,"Tara",null,"Gebrüder Jäger","Turtmann","N","IV","2017-11-21","120.1395.5441.9","Taylor","#PICADOR"]
[42,"Simba",null,"Gebrüder Jäger","Turtmann",null,null,"2015-10-01","120.1153.2317.6","Sultane","$BOCASSA",null,"4te IV Vifra 19"]
[43,"Dorina",null,"Gebrüder Jäger","Turtmann",null,null,"2014-11-01","120.1153.2313.8","Dijone","#KEIRO",null,"6te Zweitmelken Vifra 19"]
[44,"Tiara",null,"Gebrüder Jäger","Turtmann",null,null,"2015-11-01","120.1258.5634.3","Tokyo","$STARTUFF"]
[45,"Tanja",null,"Gebrüder Jäger","Turtmann",null,null,"2016-11-01","120.1258.5641.1","Tango","$PECKER"]
[46,"Lorens",null,"Gebrüder Jäger","Turtmann",null,null,"2013-10-01","120.1118.9224.9","Micabol","MONZA","8te Rotigen 20","4te IV Goler 17"]
[47,"Lenja",null,"Hischier H. & Bühlmann J.","Oberems",null,null,"2015-11-01","120.1197.2405.4","Lana","#CARNAVAL"]
[48,"Jamada",null,"Hischier H. & Bühlmann J.","Oberems",null,null,"2014-12-01","120.1202.2001.9","Janis","@GLOU-GLOU"]
[49,"Gina-Lisa",null,"Hischier Pius","Unterems","N","IV","2017-11-07","120.1324.6168.4","Gloria","$CARNAGE"]
[50,"Pruedence",null,"Hischier Pius","Unterems","N","IV","2017-12-01","120.1324.6169","Pelila","@Jenal"]
[51,"Safira",null,"Hischier Pius","Unterems",null,null,"2015-10-01","120.1188.2113.6","Safira","@BISOTTO"]
[52,"Pablo",null,"Hischier Pius","Unterems",null,null,"2013-12-01","120.0990.3391.7","Puma","$SATYR",null,"2te II Goler 19"]
[53,"Caline",null,"Jäger Carlo & Lukas","Turtmann","N","IV","2017-10-24","120.1335.1513.3","Cobra","$BOCASSA"]
[54,"Flora",null,"Jäger Carlo & Lukas","Turtmann","N","IV","2017-10-23","120.1335.1512.6","Fera","PERSEUS","3te V Rotigen 20"]
[55,"Mesagne",null,"Jäger Carlo & Lukas","Turtmann","N","IV","2017-10-29","120.1335.1516.4","Maila","#PRIMUS","Königin V Rotigen 20"]
[56,"Mygale",null,"Jäger Carlo & Lukas","Turtmann","N","IV","2017-12-08","120.1335.1522.5","Mascotte","#PRINCE"]
[57,"Prune",null,"Jäger Carlo & Lukas","Turtmann","N",null,"2016-11-25","120.1335.1504.1","Promise","NEGUS"]
[58,"Bataille",null,"Jäger Carlo & Lukas","Turtmann",null,null,"2015-11-01","120.1228.8024.2","Bandit","MILOU",null,"5te V Vifra 18"]
[59,"Samba",null,"Jäger Carlo & Lukas","Turtmann","N","IV","2017-10-19","120.1335.1511.9","Sera","@BOCASSA"]
[60,"Bayonne",null,"Jäger Carlo & Lukas","Turtmann",null,null,"2015-10-01","120.1228.8022.8","Barlette","MILOU"]
[61,"Grolla",null,"Jäger Carlo & Lukas","Turtmann",null,null,"2016-09-01","120.1228.8029.7","Gitane","#PRINCE"]
[62,"Megane",null,"Jäger Carlo & Lukas","Turtmann",null,null,"2016-12-01","120.1335.1507.2","Mandolin","#PRIMUS"]
[63,"Metis",null,"Jäger Carlo & Lukas","Turtmann",null,null,"2016-11-01","120.1335.1505.8","Mitis","#PRINCE"]
[64,"Sera",null,"Jäger Carlo & Lukas","Turtmann",null,null,"2014-10-01","120.1151.1686.0","Brunette","ZETOR","2te IV Rotigen 18"]
[65,"Pivoine",null,"Jäger Carlo & Lukas","Turtmann",null,null,"2016-12-01","120.1333.7067.1","Princesse","@COQUIN 64"]
[66,"Taverne",null,"Jäger Carlo & Lukas","Turtmann",null,null,"2016-10-01","120.1270.2454.2","Tina","@CERVIN"]
[67,"Tokio",null,"Jäger Carlo & Lukas","Turtmann",null,null,"2015-10-01","120.1151.1700.3","Tigresse","MILOU","Königin IV Rotigen 19"]
[68,"Baghira",null,"Mathieu Leander & Sascha","Albinen",null,null,"2013-11-01","120.0931.3517.4","Bataille","@CATUS",null,"6e IV Goler 17t"]
[69,"Bavaria",null,"Mathieu Leander & Sascha","Albinen",null,null,"2012-10-01","120.0930.1107.2","Boa","$TARTUFF"]
[70,"Bonita",null,"Mathieu Leander & Sascha","Albinen",null,null,"2012-10-01","120.0930.1109.6","Belon","$VITO"]
[71,"Balea",null,"Mathieu Leander & Sascha","Albinen","N","IV","2017-11-01","120.1407.8122.4","Bavaria","@MARCIANO"]
[72,"Babylon",null,"Mathieu Leander & Sascha","Albinen",null,null,"2014-12-01","120.1201.2202.3","Barillo","SHACARI",null,"2te IV Goler 18"]
[73,"Bajka",null,"Stallung Passeraub","Getwing","N","IV","2017-10-23","120.1327.2436.9","Ballerine ","$TONUS"]
[74,"Beryl",null,"Stallung Passeraub","Getwing","N","IV","2017-09-17","120.1327.2440.6","Bobino","$TWISTER"]
[75,"Menance",null,"Stallung Passeraub","Getwing","N","IV","2017-10-22","120.1327.2435.2","Medusa","@CARIBOU"]
[76,"Pablo",null,"Hutter Richard ","Lalden","N",null,"2016-11-04","120.1324.8848.3","Peluche","#CORBI"]
[77,"Beres",null,"Stallung Passeraub","Getwing",null,null,"2016-10-01","120.1327.2422.2","Belle","#CALIMERO","Königin V Rotigen 19"]
[78,"Ballerine",null,"Stallung Passeraub","Getwing",null,null,"2014-12-01","120.1188.5412.7","Bombache","CACTUS","Königin IV Rotigen 18","6te IV Kantonal 18"]
[79,"Marla",null,"Stallung Passeraub","Getwing",null,null,"2016-09-01","120.1327.2424.6","Mochita","#CORBI"]
[80,"Bonita",null,"Stallung Passeraub","Getwing",null,null,"2014-01-01","1201118.4001.1","Bombache","MALI"]
[81,"Fägär",null,"Hutter Richard","Lalden",null,null,"2016-09-01","120.1327.2427.7","Fortuna","$TWISTER"]
[82,"Bobino",null,"Stallung Passeraub","Getwing",null,null,"2013-11-01","120.1118.4000.4","Berenice","#NAT"]
[83,"Cayenne",null,"Stallung zum Stäg","St. Niklaus","N",null,"2015-12-25","120.1258.8839.9","Chealsy","TAO"]
[84,"Santana",null,"Stallung zum Stäg","St. Niklaus","N",null,"2012-11-08","120.0995.8303.0","Samanta","$VITO",null,"2te V Sembrancher 15\n2te V Final Nat "]
[85,"Samantha",null,"Sewer R. & Thommen S.","Turtmann","N","IV","2017-10-18","120.1330.9651.9","Saphira","@Jenal"]
[86,"Tessa",null,"Sewer R. & Thommen S.","Turtmann","N","IV","2017-11-04","120.1324.5082.4","Tacona","#VILAR"]
[87,"Tiara",null,"Sewer R. & Thommen S.","Susten",null,null,"2012-11-01","120.0924.5773.4","Track","@LUCA",null,"7te III Goler 18"]
[88,"Malice",null,"Sewer R. & Thommen S.","Susten",null,null,"2015-11-01","120.0618.4544.9","Mirage","@MELCHIOR",null,"7te IV Goler 19"]
[89,"Biscot",null,"Sewer R. & Thommen S.","Susten",null,null,"2015-11-01","120.1255.5712.7","Bobino","POUDRE"]
[90,"Bolera",null,"Sewer R. & Thommen S.","Susten",null,null,"2015-10-01","120.1188.0914.1","Bango","FABIUS-FAROUK","4te V Rotigen 18"]
[91,"Carolin",null,"Tscherry Erwin & Bernhard","Agarn",null,null,"2014-09-01","120.1086.2394.8","Cuba","@NOUNOURS"]
[92,"Tomba",null,"Tscherry Erwin & Bernhard","Agarn","N","IV","2017-11-04","120.1349.1597.0","Tulip","@JENAL"]
[93,"Tonic",null,"Williner Anton","Visp","N","IV","2017-10-25","120.1252.8388.0","Tara","VAMPIRE"]
[94,"Tigra",null,"Williner Anton","Visp",null,null,"2012-01-01","120.0955.4046.4","Tina","BEN","2te Griebelalp 18"]
[95,"Vivana",null,"Williner Anton","Visp",null,null,"2011-11-01","120.0923.7668.4","Violine","BEN","Königin Griebelalp 18"]
[96,"Vanessa",null,"Williner Anton","Visp",null,null,"2012-11-01","120.0955.4060.0","Vallesia","CHUCK","3te IV Rotigen 16","2te IV Goler 15"]
[97,"Violine",null,"Williner Anton","Visp","N",null,"2016-12-01","120.1252.8373.6","Vivana","VANCOUVER"]
[98,"Tira",null,"Williner Anton","Visp",null,null,"2012-11-01","120.0955.4058.7","Tomba","CHUCK"]
[99,"Rijana",null,"Wyssen Diego & Madlen","Susten","N","IV","2017-10-20","120.1399.9203.7","Ranja","PALADIN"]
[100,"Xantara",null,"Wyssen Diego & Madlen","Susten","N","IV","2017-10-05","120.1330.2483.3","Xera","#TURBULENCE"]
[101,"Xandria",null,"Wyssen Diego & Madlen","Susten",null,null,"2015-11-01","120.1256.8890.6","Xenja","#TORRO"]
[102,"Rasta",null,"Wyssen Diego & Madlen","Susten",null,null,"2015-11-01","120.1256.8888.3","Ranja","#TORRO"]
[103,"Xena",null,"Wyssen Diego & Madlen","Susten",null,null,"2013-11-01","120.1118.6566.3","Xera","FOUDRE","7et V Rotigen 16"]
[104,"Xhyla",null,"Wyssen Diego & Madlen","Susten",null,null,"2014-10-01","120.1127.8750.6","Xenia","#TURBULENCE","4te V Rotigen 17"]
[105,"Corona",null,"Zumoberhaus Pius","Oberwald","N",null,"2016-10-21","120.1258.8840.5","Coucou","@NEYMAR"]
[106,"Miss",null,"Zumoberhaus Pius","Oberwald","N",null,"2016-11-22","120.1331.0291.3","Milka","MILO"]
[107,"Violin",null,"Zumofen / Gattlen","Turtmann",null,null,"2013-11-01","120.0708.7752.3","Volero","$VITUS",null,"3te Zweitmelken Vifra 18"]
[108,"Violette",null,"Zumofen / Gattlen","Turtmann",null,null,"2015-09-01","120.1201.9782.3","Volero","$BREONA"]
[109,"Rena",null,"Zumofen / Gattlen","Turtmann",null,null,"2016-01-01","120.1269.9552.2","Ruby","@CARIBOU"]
[110,"Xena",null,"Zumofen / Gattlen","Turtmann",null,null,null,"120.1051.2928.3","Xenti","@CARIBOU","3te Rotigen 19"]
[111,"Palona",null,"Zumofen / Gattlen","Turtmann","N",null,"2015-10-23","120.1201.9787.8","Papillon","#CAPO"]
[112,"Riva",null,"Zimmermann Ivan & Monika","Getwing",null,null,"2015-10-01","120.1201.9784.7","Rocky","#CAPO"]
[113,"Vanda",null,"Zumofen / Gattlen","Turtmann",null,null,"2015-09-01","120.1201.9781.6","Volero","$BREONA"]
[114,"Maya",null,"Zumofen / Gattlen","Turtmann",null,null,"2016-12-01","120.1269.9561.4","Milou","#TORRO"]
[115,"Souris",null,"Zumofen / Gattlen","Turtmann","N",null,"2015-10-10","120.1196.8739.7","Souris","#CAPO"]
[116,"Pinoccio",null,"Zumofen / Gattlen","Turtmann",null,null,"2016-10-01","120.1269.9557.7","Pengal","FIGGEBENGEL"]
[117,"Rigolo",null,"Zumofen / Gattlen","Turtmann",null,null,"2016-10-01","120.1269.9554.6","Rocky","$BREONA"]
[118,"Vesuv",null,"Zumofen / Gattlen","Turtmann",null,null,"2016-11-01","120.1269.9558.4","Volero","#TORRO"]
[119,"Fayola",null,"Zumofen / Gattlen","Turtmann",null,null,"2014-09-01","120.0708.7750.9","Fiorenza","#VOLERIO","11te Rotigen 20"]
[120,"Rambo",null,"Zumofen / Gattlen","Turtmann",null,null,"2014-09-01","120.0708.7749.3","Rocky","#VOLERIO"]
[121,"Raja",null,"Zumofen / Gattlen","Turtmann","N","IV","2017-11-07","120.1402.0657.4","Rocky","#MARSAL"]
[122,"Xana",null,"Zumofen / Gattlen","Turtmann","N","IV","2017-12-11","120.1402.0663.5","Xena","#MARSAL"]
[123,"Fachita",null,"Zumofen / Gattlen","Turtmann","N","IV","2017-11-23","120.1402.0661.1","Fanjo","#MARSAL"]
[124,"Xara",null,"Zumofen / Gattlen","Turtmann","N",null,"2017-01-06","120.1269.9563.8","Xena","#TORRO"]
[null,null,null,null,null,null,null,null,null,null," "]
[]
["Viel Vergnügen wünschen die Alpgenossenschaft Turtmanntal und die Bestosser der Alpe Rotigen"]

{"sheet":"2020","index":7,"n_rows":143,"n_cols":12,"rows_kept":143,"cut":false,"hidden":false,"merged":[]}
[]
[null,"Alpe Rotigen Turtmanntal"]
[]
[null,null,null,"Alpaufzug vom 13. Juni 2020"]
[]
[]
[null,null,"Königin 2018 + 2019",116,null,null,"Tiere",null,null,null,"Klassiert 2019 und nicht da"]
[]
[null,null,"Trupposiegerin",26,null,"IV","Erstmelken",null,null,null,"Tigres von Fam. Leiggener (9em)"]
[null,null,null,null,null,null,null,null,null,null,"Puma von Zumofen/Gattlen (10em)"]
[null,null,"Klassiert 2019",2,null,"N","Neu (Nicht da 2019)",null,null,null,"Santiago von Bregy Ralf + Adolf (14em)"]
[]
[]
["Nr.","Name","Besitzer","Ort",null,null,"Geb.","BDTA","Mutter","Vater","Klassierungen Alpe","Klassierungen Match"]
[]
[1,"Diabolo","Bayard Medard + Gustav","N`Gampel",null,null,"2011-11-01","120.0898.9041.4","Dragon","@PARATI"]
[2,"Fantastic","Bayard Medard + Gustav","N`Gampel","N",null,"2015-12-01","120.1201.9792.2","Chinook","#CAPO","4em IV Rotigen 19"]
[3,"Priska","Bayard Medard + Gustav","N`Gampel","N",null,"2015-11-01","120.0618.4540.1","Pinka","@MELCHIOR","3em IV Rotigen 19"]
[4,"Vampir","Bayard Medard + Gustav","N`Gampel","N",null,"2015-10-01","120.0618.4536.4","Violette","@MELCHIOR"]
[5,"Pandera","Bayard Medard + Gustav","N`Gampel",null,null,"2014-12-01","120.0618.4534.0","Pinka","PRINZ"]
[6,"Venus","Bayard Medard + Gustav","N`Gampel","N",null,"2014-11-01","120.0618.4532.6","Violette","@MAC"]
[7,"Canaille","Bregy Ralf + Adolf","Unterems",null,null,"2012-10-01","120.0591.3322.0","Chealsy","$BREONA","REINE Rotigen 19     REINE Rotigen 18 \n3em Rotigen 17 \nReine V Rotigen 15","4em V Goler 15"]
[8,"Creola","Bregy Ralf + Adolf","Unterems",null,null,"2011-10-01","120.0935.2375.9","Dorina","$BREONA","5em Rotigen 19 \n13em Rotigen 18 \n12em Rotigen 17 \n3em V Rotigen 14","Reine I Goler 19\n4em IV Kantonal 15\n3em V Goler 14"]
[9,"Flacari","Bregy Ralf + Adolf","Unterems",null,null,"2010-11-01","120.0931.3303.3","Flash","@CARIBOU","4em Rotigen 19              5em Rotigen 18\n10em Rotigen 17 \n15em Rotigen 16  \n4em V Rotigen 13"]
[10,"Diabolo","Bregy Ralf + Adolf","Unterems",null,null,"2014-10-01","120.0591.9312.5","Creola","#TEIRO",null,"Reine 2eme veau Vifra 19  \n4em IV Martigny 18"]
[11,"Carcas","Bregy Ralf + Adolf","Unterems","N","IV","2016-10-01","120.1255.5041.8","Cartouche","#CASINO",null,"Reine V Goler 19"]
[12,"Milow","Bregy Silvan + Patrick","Unterems",null,null,"2011-09-01","120.0931.3304.0","Maruschka","$BREONA","6em Rotigen 19 \n4em Rotigen 18 \n13em Rotigen 17 ","5em II Goler 18 \n2em V Goler 14"]
[13,"Tequilla","Bregy Silvan + Patrick","Unterems",null,null,"2012-12-01","120.0931.3329.3","Tragonja","#TEIRO","11em Rotigen 19"]
[14,"Canabis","Bregy Ralf + Adolf","Unterems",null,null,"2015-11-01","120.1255.5036.4","Canaille","@BISON",null,"2em IV Vifra 19"]
[15,"Cashida","Bregy Ralf + Adolf","Unterems","N","IV","2016-09-01","120.1255.5038.8","Clairon","$BREONA",null,"2em V Goler 19"]
[16,"Flacabre","Bregy Ralf + Adolf","Unterems","N","IV","2016-10-01","120.1255.5039.5","Flacari","$BREONA"]
[17,"Coquette","Bregy Ralf + Adolf","Unterems","N","IV","2016-10-01","120.1255.5043.2","Canaille","#ZIRO"]
[18,"Souki","Bregy Uli + Pascal","Ergisch",null,null,"2009-10-01","120.0745.7355.1","Mirage","COQUIN"]
[19,"Tiranie","Bregy Uli + Pascal","Ergisch",null,null,"2013-11-01","120.1121.4498.9","Tsatagne","ZOLA","Reine IV Vieux They 17"]
[20,"Caline","Bregy Uli + Pascal","Ergisch",null,null,"2010-10-01","120.0919.1804.5","Calimero","$BOCASSA","14em Rotigen 19 \n4em V Rotigen 13","3em IV Goler 14 \n3em V Goler 13"]
[21,"Bora","Bregy Uli + Pascal","Ergisch",null,null,"2012-09-01","120.0999.4111.3","Bobino","@BIRK","12em ZALAN D`AYENT 18"]
[22,"Xaphir","Bregy Uli + Pascal","Ergisch",null,null,"2015-10-01","120.1213.2629.1","Xenja","TOUAREG","5em V Rotigen 18","3em V Goler 18"]
[23,"Pandora","Bregy Uli + Pascal","Ergisch",null,null,"2013-01-01","120.1050.6417.1","Paloma","$TARTUFF"]
[24,"Catalina","Bregy Uli + Pascal","Ergisch",null,null,"2013-10-01","120.1050.6420.1","Caline","SHACARI",null,"6em II Goler 19"]
[25,"Calette","Bregy Uli + Pascal","Ergisch","N","IV","2016-11-01","120.1328.6981.7","Caprice","@FAKIR"]
[26,"Cataleya","Bregy Uli + Pascal","Ergisch","N","IV","2016-11-01","120.1320.9486.8","Caline","$JAKARI"]
[27,"Murphy","Bregy Uli + Pascal","Ergisch","N","IV","2016-12-01","120.1329.8033.8","Manga","@FAKIR"]
[28,"Corona","Bregy Uli + Pascal","Ergisch","N","IV","2016-10-01","120.1249.2515.6","Cobra","CASSIUS"]
[29,"Rebell","Fam. Leiggener","Agarn",null,null,"2010-09-01","120.0761.3757.7","Riva","@BIRK",null,"5em II Goler 16"]
[30,"Bulle","Fam. Leiggener","Agarn",null,null,"2012-11-01","120.1000.4525.0","Briska","#TORRES"]
[31,"Baron","Fam. Leiggener","Agarn",null,null,"2016-01-01","120.1278.5681.5","Bijoux","$VITO"]
[32,"Mira","Fam. Leiggener","Agarn","N","IV","2017-02-01","120.1285.3022.6","Bison","BARON"]
[33,"Baquera","Fux W., J., + Wyer Piet","Eggerberg","N","IV","2016-10-01","120.1273.8032.7","Bataille","CASANOVA"]
[34,"Souris","Fux W., J., + Wyer Piet","Eggerberg",null,null,"2013-11-01","120.1119.8615.3","Santana","TIGER"]
[35,"Valaisanne","Fux W., J., + Wyer Piet","Eggerberg",null,null,"2015-01-01","120.1186.6943.1","Vagabonde","VAMPIR"]
[36,"Calmy","Fux W., J., + Wyer Piet","Eggerberg","N",null,"2015-10-01","120.1262.1659.7","Caprice","VASCO"]
[38,"Bresil","Fux W., J., + Wyer Piet","Eggerberg",null,null,"2013-01-01","120.1055.7163.1","Afifa","#TORRES"]
[39,"Bacardi","Fux W., J., + Wyer Piet","Eggerberg",null,null,"2014-10-01","120.1186.6938.7","Bataille","VASCO",null,"5em 2eme veau Vifra 19"]
[40,"Toscana","Fux W., J., + Wyer Piet","Eggerberg",null,null,"2014-10-01","120.1186.6939.4","Tarzan","TIGER",null,"Reine V Vifra 17"]
[41,"Mystic","Fux W., J., + Wyer Piet","Eggerberg",null,null,"2011-10-01","120.0995.2546.7","Etoile","MAGIC",null,"6em IV Goler 16 \n3em III Goler 18"]
[43,"Pampère","Fux W., J., + Wyer Piet","Eggerberg","N","IV","2016-10-01","120.1273.8034.1","Pigalle","CASANOVA"]
[44,"Dorina","Gebr. Jäger","Turtmann",null,null,"2014-11-01","120.1153.2313.8","Dijone","#KEIRO",null,"6em 2eme veau Vifra 19"]
[45,"Tamango","Gebr. Jäger","Turtmann",null,null,"2010-11-01","120.0919.0508.3","Tina","#KEIRO","6em Rotigen 19           10em Rotigen 17 \n15em Rotigen 16 \n4em V Rotigen 13 ","2em 2eme veau Vifra 15"]
[46,"Lorens","Gebr. Jäger","Turtmann",null,null,"2013-10-01","120.1118.9224.9","Micabol","MONZA",null,"4em IV Goler 17"]
[47,"Tiara","Gebr. Jäger","Turtmann",null,null,"2015-11-01","120.1258.5634.3","Tokyo","$TARTUFF"]
[48,"Simba","Gebr. Jäger","Turtmann",null,null,"2015-10-01","120.1153.2317.6","Sultane","$BOCASSA",null,"4em IV Vifra 19 \n7em V Zermatt 18"]
[49,"Solara","Gebr. Jäger","Turtmann","N","IV","2017-01-01","120.1300.6936.3","Samba","#TEIRO"]
[50,"Tanja","Gebr. Jäger","Turtmann","N","IV","2016-11-01","120.1258.5641.1","Tango","$PECKER"]
[]
[51,"Jamanda","Hischier H. + Bühlmann J.","Oberems",null,null,"2014-12-01","120.1202.2001.9","Janis","@GLOU-GLOU"]
[52,"Lenja","Hischier H. + Bühlmann J.","Oberems",null,null,"2015-11-01","120.1197.2405.4","Lana","#CARNAVAL"]
[53,"Safira","Hischier Pius","Unterems",null,null,"2015-10-01","120.1188.2113.6","Safira","@BISCOTTO"]
[54,"Pablo","Hischier Pius","Unterems",null,null,"2013-12-01","120.0990.3391.7","Puma","$SATYR",null,"2em II Goler 19"]
[55,"Pelila","Hischier Pius","Unterems",null,null,"2013-12-01","120.0990.3390.0","Puma","$SATYR"]
[56,"Shakira","Hischier Pius","Unterems",null,null,"2013-12-01","120.0623.7070.4","Safira","@VALENTINO"]
[57,"Promise","Jäger Carlo","Turtmann",null,null,"2009-10-01","120.0836.1545.7","Princesse","FRANCO","9em Rotigen 19         Reine IV Rotigen 13\nReine V Rotigen 12","7em I Goler 16"]
[58,"Bataille","Jäger Carlo","Turtmann","N",null,"2015-11-01","120.1228.8024.2","Bandit","MILOU",null," 5em V Vifra 18"]
[59,"Maila","Jäger Carlo","Turtmann",null,null,"2012-11-01","120.1055.8462.4","Mona","RAMBAR"]
[60,"Bayonne","Jäger Carlo","Turtmann","N",null,"2015-10-01","120.1228.8022.8","Barlette","MILOU"]
[61,"Grolla","Jäger Carlo","Turtmann","N","IV","2016-09-01","120.1228.8029.7","Gitane","#PRINCE"]
[62,"Candice","Jäger Carlo","Turtmann",null,null,"2014-11-01","120.1151.1687.7","Pinda","MILOU",null,"6em IV Goler 18"]
[63,"Pisa","Jäger Carlo","Turtmann",null,null,"2013-10-01","120.1068.9667.2","Pomette","FAKIR","Reine IV Rotigen 17"]
[64,"Sera","Jäger Carlo","Turtmann",null,null,"2014-10-01","120.1151.1686.0","Brunette","ZETOR","2em IV Rotigen 18 \n3em V Rotigen 17"]
[65,"Megane","Jäger Carlo","Turtmann","N","IV","2016-12-01","120.1335.1507.2","Mandolin","#PRIMUS"]
[66,"Metis","Jäger Carlo","Turtmann","N","IV","2016-11-01","120.1335.1505.8","Mitis","#PRINCE"]
[67,"Micabol","Jäger Carlo","Turtmann","N",null,"2015-10-01","120.1228.8023.5","Magalie","MILOU"]
[68,"Pivoine","Jäger Carlo","Turtmann","N","IV","2016-12-01","120.1333.7067.1","Princesse","@COQUIN 64"]
[69,"Taverne","Jäger Carlo","Turtmann","N ","IV","2016-10-01","120.1270.2454.2","Tina","@CERVIN"]
[70,"Tokio","Jäger Carlo","Turtmann","N",null,"2015-10-01","120.1151.1700.3","Tigresse","MILOU","Reine IV Rotigen 19"]
[71,"Baghira","Mathieu Leander + S.","Albinen",null,null,"2013-11-01","120.0931.3517.4","Baghira ","@CACTUS",null,"6em IV Goler 17"]
[72,"Baronesse","Mathieu Leander + S.","Albinen",null,null,"2014-02-01","120.0931.3527.3","Baron","@BISON"]
[73,"Bavaria","Mathieu Leander + S.","Albinen",null,null,"2012-10-01","120.0930.1107.2","Boa","$TARTUFF"]
[74,"Belon","Mathieu Leander + S.","Albinen",null,null,"2008-11-01","120.0765.3580.9","Bandit","@CAPSULE",null,"6em II Goler 16 \n2em III Kantonal 16 \n2em III Goler 16 \n2em III Goler 14"]
[75,"Bonita","Mathieu Leander + S.","Albinen",null,null,"2012-10-01","120.0930.1109.6","Belon","$VITO"]
[76,"Babylon","Mathieu Leander + S.","Albinen",null,null,"2014-12-01","120.1201.2202.3","Barillo","SHACARI",null,"2em IV Goler 18"]
[77,"Beres","Stallung Passeraub","Getwing","N","IV","2016-10-01","120.1327.2422.2","Belle","#CALIMERO","Reine V Rotigen 19"]
[78,"Ballerine","Stallung Passeraub","Getwing",null,null,"2014-12-01","120.1188.5412.7","Bombache","CACTUS","Reine IV Rotigen 18 \nReine V Rotigen 17","6em IV Kantonal 18 \n3em IV Goler 18 "]
[79,"Marla","Stallung Passeraub ","Getwing","N","IV","2016-09-01","120.1327.2424.6","Mochita","#CORBI"]
[80,"Manou","Stallung Passeraub ","Getwing",null,null,"2013-11-01","120.1118.3994.7","Mamou","MALI"]
[81,"Medusa","Stallung Passeraub ","Getwing",null,null,"2013-10-01","120.1064.0583.6","Mitis","MALI"]
[82,"Bonita","Stallung Passeraub ","Getwing",null,null,"2014-01-01","120.1118.4001.1","Bombache","MALI"]
[83,"Lijuba","Amacker Joelle u. Sven","Getwing","N","IV","2016-09-01","120.1327.2425.3","Linera","$TWISTER","4em V Rotigen 19"]
[84,"Fägär","Hutter Richard","Getwing","N","IV","2016-09-01","120.1327.2427.7","Fortuna","$TWISTER"]
[85,"Bobino","Stallung Passeraub","Getwing",null,null,"2013-11-01","120.1118.4000.4","Berenice","#NAT"]
[86,"Babylon","Stallung zum Stäg","St. Niklaus",null,null,"2015-10-01","120.1062.2041.5","Benika","@DARIUS"]
[87,"Benika","Stallung zum Stäg","St. Niklaus",null,null,"2013-01-01","120.1036.6445.8","Benichou","GITAN"]
[88,"Malice","Sewer R. + Thommen S.","Susten","N",null,"2015-11-01","120.0618.4544.9","Mirage","@MELCHIOR",null,"7em IV Goler 19"]
[89,"Tiara","Sewer R. + Thommen S.","Susten",null,null,"2012-11-01","120.0924.5773.4","Track","@LUCA",null,"7em III Goler 18"]
[90,"Biscot","Sewer R. + Thommen S.","Susten",null,null,"2015-11-01","120.1255.5712.7","Bobino","POUDRE"]
[91,"Bolera","Sewer R. + Thommen S.","Susten",null,null,"2015-10-01","120.1188.0914.1","Bango","FABIUS-FAROUK","4em V Rotigen 18"]
[93,"Carolin","Tscherry E. + B.","Agarn",null,null,"2014-09-01","120.1086.2394.8","Cuba","@NOUNOURS"]
[94,"Cobra","Tscherry E. + B.","Agarn",null,null,"2011-11-01","120.0942.4296.3","Cuba","@PICADOR"]
[95,"Vivana","Williner Anton","Visp",null,null,"2011-11-01","120.0923.7668.4","Violine","BEN ","Reine Griebelalp 18 \n2em Griebelalp 17 \nReine IV Rotigen 15"]
[96,"Tigra","Williner Anton","Visp",null,null,"2012-01-01","120.0955.4046.4","Tina","BEN","2em Griebelalp 18  \n6em Griebelalp 17 \n3em IV Rotigen 15"]
[97,"Vanessa","Williner Anton","Visp",null,null,"2012-11-01","120.0955.4060.0","Vallesia","CHUCK","3em IV Rotigen 16","2em V Goler 15"]
[98,"Colonell","Williner Anton","Visp",null,null,"2013-11-01","120.0687.0260.8","Carmelin","VARIO","5em IV Rotigen 17","7em IV Goler 17"]
[99,"Diva","Williner Anton","Visp",null,null,"2013-11-01","120.0687.0255.4","Dorin","BENO","2em IV Rotigen 17"]
[100,"Tira","Williner Anton","Visp",null,null,"2012-11-01","120.0955.4058.7","Tomba","CHUCK"]
[101,"Xandria","Wyssen Diego u. Madlen","Susten",null,null,"2015-11-01","120.1256.8890.6","Xenia","#TORRO"]
[102,"Rasta","Wyssen Diego u. Madlen","Susten",null,null,"2015-11-01","120.1256.8888.3","Ranja","#TORRO"]
[103,"Roxana","Wyssen Diego u. Madlen","Susten","N",null,"2015-12-01","120.1268.8257.0"]
[104,"Xena","Wyssen Diego u. Madlen","Susten",null,null,"2013-11-01","120.1118.6566.3","Xera","FOUDRE","7em V Rotigen 16"]
[105,"Xhyla","Wyssen Diego u. Madlen","Susten",null,null,"2014-10-01","120.1127.8750.6","Xenia","#TURBULENCE","4em V Rotigen 17 "]
[106,"Rambo","Zumofen / Gattlen","Turtmann",null,null,"2014-09-01","120.0708.7749.3","Rocky ","#VOLERIO"]
[107,"Violin","Zumofen / Gattlen","Turtmann",null,null,"2013-11-01","120.0708.7752.3","Volero","$VITUS",null,"3em 2eme veau Vifra 18"]
[108,"Violette","Zumofen / Gattlen","Turtmann",null,null,"2015-09-01","120.1201.9782.3","Volero ","$BREONA"]
[109,"Rena","Zumofen / Gattlen","Turtmann",null,null,"2016-01-01","120.1269.9552.2","Ruby","@CARIBOU"]
[110,"Xena","Zumofen / Gattlen","Turtmann",null,null,"2012-10-01","120.1051.2928.3","Xenti","@CARIBOU","3em Rotigen 19 \n4em Rotigen 18"]
[111,"Vidona","Zumofen / Gattlen","Turtmann",null,null,"2015-09-01","120.1201.9780.9","Volero","$BREONA"]
[112,"Riva ","Zumofen / Gattlen","Turtmann",null,null,"2015-10-01","120.1201.9784.7","Rocky ","#CAPO"]
[113,"Vanda","Zumofen / Gattlen","Turtmann",null,null,"2015-09-01","120.1201.9781.6","Volero ","$BREONA"]
[114,"Maya","Zumofen / Gattlen","Turtmann","N ","IV","2016-12-01","120.1269.9561.4","Milou","#TORRO"]
[115,"Pepitta","Zumofen / Gattlen","Turtmann","N ",null,"2015-10-01","120.1201.9786.1","Puma","#TORRO"]
[116,"Pinoccio","Zumofen / Gattlen","Turtmann","N ","IV","2016-10-01","120.1269.9557.7","Pengal","FIGGEBENGEL"]
[117,"Rigolo","Zumofen / Gattlen","Turtmann","N ","IV","2016-10-01","120.1269.9554.6","Rocky ","$BREONA"]
[118,"Vesuv","Zumofen / Gattlen","Turtmann","N ","IV","2016-11-01","120.1269.9558.4","Volero","#TORRO"]
[119,"Fayola","Zumofen / Gattlen","Turtmann",null,null,"2014-09-01","120.0708.7750.9","Fiorenza","#VOLERIO"]
[]
[]
[]
[]
[]
[]
[]
[]
[]
[]
["Viel Vergnügen wünscht die Alpgenossenschaft Turtmanntal und die Bestosser der Alpe Rotigen.",null,null,null,null,null,null,null,null,null,null,"© Silvan Bregy"]

{"sheet":"2019","index":8,"n_rows":131,"n_cols":12,"rows_kept":131,"cut":false,"hidden":false,"merged":[]}
[]
[null,"Alpe Rotigen Turtmanntal"]
[]
[null,null,null,"Alpaufzug vom 15. Juni 2019"]
[]
[]
[null,null,"Königin 2018",113,null,null,"Tiere",null,null,null,"Klassiert 2018 und nicht da"]
[null,null,null,22,null,"IV","Erstmelken",null,null,null,"Tango von Gebr. Jäger (9em)"]
[null,null,"Trupposiegerin",38,null,"N","Neu (Nicht da 2018)",null,null,null,"Rambo von Familie Leiggener (15em)"]
[null,null,null,51,null,null,"Glocken an Ringkuhkämpfen (Insgesamt)"]
[null,null,"Klassiert 2018",37,null,null,"Klassierte Tiere an Ringkuhkämpfen"]
[]
[]
["Nr.","Name","Besitzer","Ort",null,null,"Geb.","BDTA","Mutter","Vater","Klassierungen Alpe","Klassierungen Match"]
[]
[1,"Diabolo","Bayard Medard + Gustav","N`Gampel",null,null,"2011-11-01","120.0898.9041.4","Dragon","@PARATI"]
[2,"Mirabelle","Bayard Medard + Gustav","N`Gampel",null,null,"2012-10-01","120.0998.9046.6","Merry","MESSI"]
[3,"Venus","Bayard Medard + Gustav","N`Gampel","N",null,"2014-11-01","120.0618.4532.6","Violette","@MAC"]
[4,"Ramona","Bayard Medard + Gustav","N`Gampel",null,null,"2011-10-01","120.0998.9034.3","Riquita","$VITUS",null,"4em IV Goler 15"]
[5,"Pandera","Bayard Medard + Gustav","N`Gampel","N",null,"2014-12-01","120.0618.4534.0","Pinka","PRINZ"]
[6,"Simba","Bayard Medard + Gustav","N`Gampel","N",null,"2014-10-01","120.0618.4530.2","Mousse","$TOURBILLON"]
[7,"Canaille","Bregy Ralf + Adolf","Unterems",null,null,"2012-10-01","120.0591.3322.0","Chealsy","$BREONA","REINE Rotigen 18 \n3em Rotigen 17 \nReine V Rotigen 15","4em V Goler 15"]
[8,"Creola","Bregy Ralf + Adolf","Unterems",null,null,"2011-10-01","120.0935.2375.9","Dorina","$BREONA","13em Rotigen 18 \n12em Rotigen 17 \n3em V Rotigen 14","Reine I Goler 19\n4em IV Kantonal 15\n3em V Goler 14"]
[9,"Flacari","Bregy Ralf + Adolf","Unterems",null,null,"2010-11-01","120.0931.3303.3","Flash","@CARIBOU","5em Rotigen 18 \n10em Rotigen 17 \n15em Rotigen 16  \n4em V Rotigen 13"]
[10,"Diabolo","Bregy Ralf + Adolf","Unterems",null,null,"2014-10-01","120.0591.9312.5","Creola","#TEIRO",null,"Reine 2eme veau Vifra 19 - \n4em IV Martigny 18"]
[11,"Santiago","Bregy Ralf + Adolf","Unterems",null,null,"2012-12-01","120.0931.3328.6","Scheila","#TEIRO",null,"3em IV Goler 16"]
[12,"Milow","Bregy Silvan + Patrick","Unterems",null,null,"2011-09-01","120.0931.3304.0","Maruschka","$BREONA","4em Rotigen 18 \n13em Rotigen 17 ","5em II Goler 18 \n2em V Goler 14"]
[13,"Tequilla","Bregy Silvan + Patrick","Unterems",null,null,"2012-12-01","120.0931.3329.3","Tragonja","#TEIRO"]
[14,"Canabis","Bregy Ralf + Adolf","Unterems","N","IV","2015-11-01","120.1255.5036.4","Canaille","@BISON",null,"2em IV Vifra 19"]
[15,"Catalina","Bregy Uli + Pascal","Ergisch",null,null,"2013-10-01","120.1050.6420.1","Caline","SHACARI"]
[16,"Caline","Bregy Uli + Pascal","Ergisch",null,null,"2010-10-01","120.0919.1804.5","Calimero","$BOCASSA","4em V Rotigen 13","3em IV Goler 14 \n3em V Goler 13"]
[17,"Pandora","Bregy Uli + Pascal","Ergisch",null,null,"2013-01-01","120.1050.6417.1","Paloma","$TARTUFF"]
[18,"Souki","Bregy Uli + Pascal","Ergisch",null,null,"2009-10-01","120.0745.7355.1","Mirage","COQUIN"]
[19,"Tiranie","Bregy Uli + Pascal","Ergisch",null,null,"2013-11-01","120.1121.4498.9","Tsatagne","ZOLA","Reine IV Vieux They 17"]
[20,"Manga","Bregy Uli + Pascal","Ergisch","N",null,"2010-11-01","120.0911.4528.1","Melodie","NIRKA","9em LES ARS 16 \n8em LES ARS 18"]
[21,"Bora","Bregy Uli + Pascal","Ergisch","N",null,"2012-09-01","120.0999.4111.3","Bobino","@BIRK","12em ZALAN D`AYENT 18"]
[22,"Xaphir","Bregy Uli + Pascal","Ergisch","N","IV","2015-10-01","120.1213.2629.1","Xenja","TOUAREG","5em V Rotigen 18","3em V Goler 18"]
[23,"Rebell","Fam. Leiggener","Agarn",null,null,"2010-09-01","120.0761.3757.7","Riva","@BIRK",null,"5em II Goler 16"]
[24,"Tigres","Fam. Leiggener","Agarn",null,null,"2008-12-01","120.0745.7790.0","Tito","$BOCASSA",null,"2em II Goler 15"]
[25,"Bulle","Fam. Leiggener","Agarn",null,null,"2012-11-01","120.1000.4525.0","Briska","#TORRES"]
[26,"Baron","Fam. Leiggener","Agarn","N","IV","2016-01-01","120.1278.5681.5","Bijoux","$VITO"]
[27,"Bolero","Fux W., J., + Wyer Piet","Eggerberg",null,null,"2013-11-01","120.1119.8616.0","Baguera","TIGER"]
[28,"Bresil","Fux W., J., + Wyer Piet","Eggerberg",null,null,"2013-01-01","120.1055.7163.1","Afifa","#TORRES"]
[29,"Bacardi","Fux W., J., + Wyer Piet","Eggerberg","N",null,"2014-10-01","120.1186.6938.7","Bataille","VASCO",null,"5em 2eme veau Vifra 19"]
[30,"Toscana","Fux W., J., + Wyer Piet","Eggerberg","N",null,"2014-10-01","120.1186.6939.4","Tarzan","TIGER",null,"Reine V Vifra 17"]
[31,"Mystic","Fux W., J., + Wyer Piet","Eggerberg",null,null,"2011-10-01","120.0995.2546.7","Etoile","MAGIC",null,"6em IV Goler 16 \n3em III Goler 18"]
[32,"Pigalle","Fux W., J., + Wyer Piet","Eggerberg",null,null,"2011-11-01","120.0995.2553.5","Pandora","MAGIC"]
[33,"Valaisanne","Fux W., J., + Wyer Piet","Eggerberg",null,null,"2015-01-01","120.1186.6943.1","Vagabonde","VAMPIR"]
[34,"Scarlette","Fux W., J., + Wyer Piet","Eggerberg",null,null,"2014-11-01","120.1186.6941.7","Andora","TIGER"]
[35,"Souris","Fux W., J., + Wyer Piet","Eggerberg",null,null,"2013-11-01","120.1119.8615.3","Santana","TIGER"]
[36,"Taylor","Gebr. Jäger","Turtmann",null,null,"2013-11-01","120.1118.9230.0","Tamango","$TARTUFF"]
[37,"Tamango","Gebr. Jäger","Turtmann",null,null,"2010-11-01","120.0919.0508.3","Tina","#KEIRO","10em Rotigen 17 \n15em Rotigen 16 \n4em V Rotigen 13 ","2em 2eme veau Vifra 15"]
[38,"Lorens","Gebr. Jäger","Turtmann",null,null,"2013-10-01","120.1118.9224.9","Micabol","MONZA",null,"4em IV Goler 17"]
[39,"Tiara","Gebr. Jäger","Turtmann","N","IV","2015-11-01","120.1258.5634.3","Tokyo","$TARTUFF"]
[40,"Sultane","Gebr. Jäger","Turtmann","N",null,"2011-11-01","120.0930.2250.4","Silene","PATOUCHE",null,"7em I Zermatt 18 \n7em II Goler 17 \n5em 2eme veau Vifra 15"]
[41,"Delida","Gebr. Jäger","Turtmann","N","IV","2016-03-01","120.1258.5637.4","Dora","#KEIRO"]
[42,"Simba","Gebr. Jäger","Turtmann","N","IV","2015-10-01","120.1153.2317.6","Sultane","$BOCASSA",null,"4em IV Vifra 19 \n7em V Zermatt 18"]
[43,"Dorina","Gebr. Jäger","Turtmann",null,null,"2014-11-01","120.1153.2313.8","Dijone","#KEIRO",null,"6em 2eme veau Vifra 19"]
[44,"Jamanda","Hischier H. + Bühlmann J.","Oberems","N",null,"2014-12-01","120.1202.2001.9","Janis","@GLOU-GLOU"]
[45,"Lenja","Hischier H. + Bühlmann J.","Oberems","N","IV","2015-11-01","120.1197.2405.4","Lana","#CARNAVAL"]
[46,"Safira","Hischier Pius","Unterems","N","IV","2015-10-01","120.1188.2113.6","Safira","@BISCOTTO"]
[47,"Pablo","Hischier Pius","Unterems",null,null,"2013-12-01","120.0990.3391.7","Puma","$SATYR"]
[48,"Pelila","Hischier Pius","Unterems",null,null,"2013-12-01","120.0990.3390.0","Puma","$SATYR"]
[49,"Shakira","Hischier Pius","Unterems",null,null,"2013-12-01","120.0623.7070.4","Safira","@VALENTINO"]
[50,"Sera","Jäger Carlo","Turtmann","N",null,"2014-10-01","120.1151.1686.0","Brunette","ZETOR","2em IV Rotigen 18 \n3em V Rotigen 17"]
[51,"Guxa","Jäger Carlo","Turtmann",null,null,"2009-10-01","120.0764.2445.5","Yakin","XAVER","10em CHEMEUILLE 17 "," Reine V Vifra 12"]
[52,"Maila","Jäger Carlo","Turtmann",null,null,"2012-11-01","120.1055.8462.4","Mona","RAMBAR"]
[53,"Tzigane","Jäger Carlo","Turtmann","N","IV","2015-10-01","120.1151.1699.0","Tigresse","MILOU"]
[54,"Paloma","Jäger Carlo","Turtmann",null,null,"2013-03-01","120.1068.9664.1","Princesse","NERO"]
[55,"Candice","Jäger Carlo","Turtmann","N",null,"2014-11-01","120.1151.1687.7","Pinda","MILOU",null,"6em IV Goler 18"]
[56,"Pisa","Jäger Carlo","Turtmann",null,null,"2013-10-01","120.1068.9667.2","Pomette","FAKIR","Reine IV Rotigen 17"]
[57,"Promise","Jäger Carlo","Turtmann",null,null,"2009-10-01","120.0836.1545.7","Princesse","FRANCO","Reine IV Rotigen 13\nReine V Rotigen 12","7em I Goler 16"]
[58,"Turin","Jäger Carlo","Turtmann",null,null,"2012-10-01","120.1042.9272.8","Turco","NERO","4em V Rotigen 15","3em 2eme veau Vifra 17 \n5em IV Goler 16"]
[59,"Baghira","Mathieu Leander + S.","Albinen",null,null,"2013-11-01","120.0931.3517.4","Baghira ","@CACTUS",null,"6em IV Goler 17"]
[60,"Bambino","Mathieu Leander + S.","Albinen",null,null,"2013-10-01","120.0931.3525.9","Bambi","@NATI"]
[61,"Baronesse","Mathieu Leander + S.","Albinen",null,null,"2014-02-01","120.0931.3527.3","Baron","@BISON"]
[62,"Bavaria","Mathieu Leander + S.","Albinen",null,null,"2012-10-01","120.0930.1107.2","Boa","$TARTUFF"]
[63,"Belon","Mathieu Leander + S.","Albinen",null,null,"2008-11-01","120.0765.3580.9","Bandit","@CAPSULE",null,"6em II Goler 16 \n2em III Kantonal 16 \n2em III Goler 16 \n2em III Goler 14"]
[64,"Bonita","Mathieu Leander + S.","Albinen",null,null,"2012-10-01","120.0930.1109.6","Belon","$VITO"]
[65,"Bijou","Mathieu Leander + S.","Albinen","N",null,"2014-11-01","120.1201.2201.6","Baquera","@MAC",null,"7em IV Goler 18"]
[66,"Babylon","Mathieu Leander + S.","Albinen","N",null,"2014-12-01","120.1201.2202.3","Barillo","SHACARI",null,"2em IV Goler 18"]
[67,"Ballerine","Stallung Passeraub","Getwing","N",null,"2014-12-01","120.1188.5412.7","Bombache","CACTUS","Reine IV Rotigen 18 \nReine V Rotigen 17","6em IV Kantonal 18 \n3em IV Goler 18 "]
[68,"Bulle","Stallung Passeraub","Getwing",null,null,"2013-11-01","120.1118.3996.1","Berenice","#NAT"]
[69,"Manou","Stallung Passeraub ","Getwing",null,null,"2013-11-01","120.1118.3994.7","Mamou","MALI"]
[70,"Medusa","Stallung Passeraub ","Getwing",null,null,"2013-10-01","120.1064.0583.6","Mitis","MALI"]
[71,"Bonita","Stallung Passeraub ","Getwing",null,null,"2014-01-01","120.1118.4001.1","Bombache","MALI"]
[72,"Mirette","Stallung Passeraub","Getwing",null,null,"2008-10-01","120.0623.0762.5","Moustique","@BRONSON","10em Rotigen 16\n10em Rotigen 17"]
[73,"Baghera","Stallung Passeraub","Getwing",null,null,"2013-11-01","120.1118.3998.5","Berenice","MALI",null,"5em IV Mayens de Conthey 17"]
[74,"Bobino","Stallung Passeraub","Getwing",null,null,"2013-11-01","120.1118.4000.4","Berenice","#NAT"]
[75,"Pandora","Stallung zum Stäg","St. Niklaus",null,null,"2012-12-01","120.0806.0680.9","Gibsy","@POLUX"]
[76,"Babylon","Stallung zum Stäg","St. Niklaus","N","IV","2015-10-01","120.1062.2041.5","Benika","@DARIUS"]
[77,"Benika","Stallung zum Stäg","St. Niklaus",null,null,"2013-01-01","120.1036.6445.8","Benichou","GITAN"]
[78,"Diaries","Stallung zum Stäg","St. Niklaus",null,null,"2012-12-01","120.0990.8567.1","Orcas","CLINTON"]
[79,"Tabhita","Sewer R. + Thommen S.","Susten",null,null,"2011-12-01","120.0924.5768.0","Turon","@TOSKANI"]
[80,"Tiara","Sewer R. + Thommen S.","Susten",null,null,"2012-11-01","120.0924.5773.4","Track","@LUCA",null,"7em III Goler 18"]
[81,"Biscot","Sewer R. + Thommen S.","Susten","N","IV","2015-11-01","120.1255.5712.7","Bobino","POUDRE"]
[82,"Bolera","Sewer R. + Thommen S.","Susten","N","IV","2015-10-01","120.1188.0914.1","Bango","FABIUS-FAROUK","4em V Rotigen 18"]
[83,"Carolin","Tscherry E. + B.","Agarn",null,null,"2014-09-01","120.1086.2394.8","Cuba","@NOUNOURS"]
[84,"Cobra","Tscherry E. + B.","Agarn",null,null,"2011-11-01","120.0942.4296.3","Cuba","@PICADOR"]
[85,"Vivana","Williner Anton","Visp","N",null,"2011-11-01","120.0923.7668.4","Violine","BEN ","Reine Griebelalp 18 \n2em Griebelalp 17 \nReine IV Rotigen 15"]
[86,"Tigra","Williner Anton","Visp","N",null,"2012-01-01","120.0955.4046.4","Tina","BEN","2em Griebelalp 18  \n6em Griebelalp 17 \n3em IV Rotigen 15"]
[87,"Vanessa","Williner Anton","Visp",null,null,"2012-11-01","120.0955.4060.0","Vallesia","CHUCK","3em IV Rotigen 16","2em V Goler 15"]
[88,"Colonell","Williner Anton","Visp",null,null,"2013-11-01","120.0687.0260.8","Carmelin","VARIO","5em IV Rotigen 17","7em IV Goler 17"]
[89,"Diva","Williner Anton","Visp",null,null,"2013-11-01","120.0687.0255.4","Dorin","BENO","2em IV Rotigen 17"]
[90,"Tira","Williner Anton","Visp",null,null,"2012-11-01","120.0955.4058.7","Tomba","CHUCK"]
[91,"Xandria","Wyssen Diego u. Madlen","Susten","N","IV","2015-11-01","120.1256.8890.6","Xenia","#TORRO"]
[92,"Rasta","Wyssen Diego u. Madlen","Susten","N","IV","2015-11-01","120.1256.8888.3","Ranja","#TORRO"]
[93,"Xana","Wyssen Diego u. Madlen","Susten","N","IV","2015-10-01","120.1256.8886.9","Xantia","$TERREUR"]
[94,"Xanja","Wyssen Diego u. Madlen","Susten",null,null,"2013-11-01","120.1118.6567.0","Xenia","#TURBULENCE","7em V Rotigen 16"]
[95,"Xena","Wyssen Diego u. Madlen","Susten",null,null,"2013-11-01","120.1118.6566.3","Xera","FOUDRE","7em V Rotigen 16"]
[96,"Xhyla","Wyssen Diego u. Madlen","Susten",null,null,"2014-10-01","120.1127.8750.6","Xenia","#TURBULENCE","4em V Rotigen 17 "]
[97,"Napapiri","Zumoberhaus P. + Familie","Oberwald",null,null,"2012-10-01","120.1054.6787.3","Nana","BIMI",null,"4em IV Belalp 16"]
[98,"Ninja","Zumoberhaus P. + Familie","Oberwald ","N","IV","2015-12-01","120.1258.8838.2","Nana","TAO",null,"4em V Goler 18"]
[99,"Rena","Zumofen / Gattlen","Turtmann","N ","IV","2016-01-01","120.1269.9552.2","Ruby","@CARIBOU"]
[100,"Ahkira","Zumofen / Gattlen","Turtmann",null,null,"2014-10-01","120.1118.4004.2","Arizona","$BREONA"]
[101,"Fangio","Zumofen / Gattlen","Turtmann",null,null,"2013-11-01","120.1095.6908.5","Fiasco","RAMBO"]
[102,"Fayola","Zumofen / Gattlen","Turtmann",null,null,"2014-09-01","120.0708.7750.9","Fiorenza","#VOLERIO"]
[103,"Milou","Zumofen / Gattlen","Turtmann",null,null,"2011-10-01","120.0944.5559.2","Pinson","NESTOR",null,"6em I Goler 18"]
[104,"Adonis","Zumofen / Gattlen","Turtmann","N ","IV","2015-11-01","120.1201.9788.5","Adonis","#CAPO"]
[105,"Puma","Zumofen / Gattlen","Turtmann",null,null,"2010-11-01","120.0875.3387.0","Puma","@CARIBOU","5em Rotigen 18  \n12em Rotigen 17 ","2em II Goler 17"]
[106,"Rambo","Zumofen / Gattlen","Turtmann",null,null,"2014-09-01","120.0708.7749.3","Rocky ","#VOLERIO"]
[107,"Violin","Zumofen / Gattlen","Turtmann",null,null,"2013-11-01","120.0708.7752.3","Volero","$VITUS",null,"3em 2eme veau Vifra 18"]
[108,"Violette","Zumofen / Gattlen","Turtmann","N ","IV","2015-09-01","120.1201.9782.3","Volero ","$BREONA"]
[109,"Vulcana","Zumofen / Gattlen","Turtmann",null,null,"2014-10-01","120.0708.7755.4","Vandale","@GLOU-GLOU"]
[110,"Xena","Zumofen / Gattlen","Turtmann",null,null,"2012-10-01","120.1051.2928.3","Xenti","@CARIBOU","4em Rotigen 18"]
[111,"Vidona","Zumofen / Gattlen","Turtmann","N ","IV","2015-09-01","120.1201.9780.9","Volero","$BREONA"]
[112,"Riva ","Zumofen / Gattlen","Turtmann","N","IV","2015-10-01","120.1201.9784.7","Rocky ","#CAPO"]
[113,"Vanda","Zumofen / Gattlen","Turtmann","N ","IV","2015-09-01","120.1201.9781.6","Volero ","$BREONA"]
[]
[]
["Viel Vergnügen wünscht die Alpgenossenschaft Turtmanntal und die Bestosser der Alpe Rotigen.",null,null,null,null,null,null,null,null,null,null,"© Silvan Bregy"]

{"sheet":"2018","index":9,"n_rows":119,"n_cols":7,"rows_kept":119,"cut":false,"hidden":false,"merged":[[4,0,4,6]]}
[]
[]
[]
[]
["Rot = Troupeau-Siegerin "]
["Nr.","Name","Ohrmarkennr.","Geburtsdat.","Vater","Mutter","Eigentümer"]
[1,"Diabolo","120.0898.9041.4","2011-11-01","@PARATI","Dragon","Bayard Medard + Gustav"]
[2,"Mirabelle","120.0998.9046.6","2012-10-01","MESSI","Merry","Bayard Medard + Gustav"]
[3,"Venus","120.0618.4532.6","2014-11-01","@MAC","Violette","Bayard Medard + Gustav"]
[4,"Ramona","120.0998.9034.3","2011-10-01","$VITUS","Riquita","Bayard Medard + Gustav"]
[5,"Pandera","120.0618.4534.0","2014-12-01","PRINZ","Pinka","Bayard Medard + Gustav"]
[6,"Simba","120.0618.4530.2","2014-10-01","$TOURBILLON","Mousse","Bayard Medard + Gustav"]
[7,"Canaille","120.0591.3322.0","2012-10-01","$BREONA","Chealsy","Bregy Ralf + Adolf"]
[8,"Creola","120.0935.2375.9","2011-10-01","$BREONA","Dorina","Bregy Ralf + Adolf"]
[9,"Flacari","120.0931.3303.3","2010-11-01","@CARIBOU","Flash","Bregy Ralf + Adolf"]
[10,"Diabolo","120.0591.9312.5","2014-10-01","#TEIRO","Creola","Bregy Ralf + Adolf"]
[11,"Santiago","120.0931.3328.6","2012-12-01","#TEIRO","Scheila","Bregy Ralf + Adolf"]
[12,"Milow","120.0931.3304.0","2011-09-01","$BREONA","Maruschka","Bregy Silvan + Patrick"]
[13,"Tequilla","120.0931.3329.3","2012-12-01","#TEIRO","Tragonja","Bregy Silvan + Patrick"]
[14,"Canabis","120.1255.5036.4","2015-11-01","@BISON","Canaille","Bregy Ralf + Adolf"]
[15,"Catalina","120.1050.6420.1","2013-10-01","SHACARI","Caline","Bregy Uli + Pascal"]
[16,"Caline","120.0919.1804.5","2010-10-01","$BOCASSA","Calimero","Bregy Uli + Pascal"]
[17,"Pandora","120.1050.6417.1","2013-01-01","$TARTUFF","Paloma","Bregy Uli + Pascal"]
[18,"Souki","120.0745.7355.1","2009-10-01","COQUIN","Mirage","Bregy Uli + Pascal"]
[19,"Tiranie","120.1121.4498.9","2013-11-01","ZOLA","Tsatagne","Bregy Uli + Pascal"]
[20,"Manga","120.0911.4528.1","2010-11-01","NIRKA","Melodie","Bregy Uli + Pascal"]
[21,"Bora","120.0999.4111.3","2012-09-01","@BIRK","Bobino","Bregy Uli + Pascal"]
[22,"Xaphir","120.1213.2629.1","2015-10-01","TOUAREG","Xenja","Bregy Uli + Pascal"]
[23,"Rebell","120.0761.3757.7","2010-09-01","@BIRK","Riva","Fam. Leiggener"]
[24,"Tigres","120.0745.7790.0","2008-12-01","$BOCASSA","Tito","Fam. Leiggener"]
[25,"Bulle","120.1000.4525.0","2012-11-01","#TORRES","Briska","Fam. Leiggener"]
[26,"Baron","120.1278.5681.5","2016-01-01","$VITO","Bijoux","Fam. Leiggener"]
[27,"Bolero","120.1119.8616.0","2013-11-01","TIGER","Baguera","Fux W., J., + Wyer Piet"]
[28,"Bresil","120.1055.7163.1","2013-01-01","#TORRES","Afifa","Fux W., J., + Wyer Piet"]
[29,"Bacardi","120.1186.6938.7","2014-10-01","VASCO","Bataille","Fux W., J., + Wyer Piet"]
[30,"Toscana","120.1186.6939.4","2014-10-01","TIGER","Tarzan","Fux W., J., + Wyer Piet"]
[31,"Mystic","120.0995.2546.7","2011-10-01","MAGIC","Etoile","Fux W., J., + Wyer Piet"]
[32,"Pigalle","120.0995.2553.5","2011-11-01","MAGIC","Pandora","Fux W., J., + Wyer Piet"]
[33,"Valaisanne","120.1186.6943.1","2015-01-01","VAMPIR","Vagabonde","Fux W., J., + Wyer Piet"]
[34,"Scarlette","120.1186.6941.7","2014-11-01","TIGER","Andora","Fux W., J., + Wyer Piet"]
[35,"Souris","120.1119.8615.3","2013-11-01","TIGER","Santana","Fux W., J., + Wyer Piet"]
[36,"Taylor","120.1118.9230.0","2013-11-01","$TARTUFF","Tamango","Gebr. Jäger"]
[37,"Tamango","120.0919.0508.3","2010-11-01","#KEIRO","Tina","Gebr. Jäger"]
[38,"Lorens","120.1118.9224.9","2013-10-01","MONZA","Micabol","Gebr. Jäger"]
[39,"Tiara","120.1258.5634.3","2015-11-01","$TARTUFF","Tokyo","Gebr. Jäger"]
[40,"Sultane","120.0930.2250.4","2011-11-01","PATOUCHE","Silene","Gebr. Jäger"]
[41,"Delida","120.1258.5637.4","2016-03-01","#KEIRO","Dora","Gebr. Jäger"]
[42,"Simba","120.1153.2317.6","2015-10-01","$BOCASSA","Sultane","Gebr. Jäger"]
[43,"Dorina","120.1153.2313.8","2014-11-01","#KEIRO","Dijone","Gebr. Jäger"]
[44,"Jamanda","120.1202.2001.9","2014-12-01","@GLOU-GLOU","Janis","Hischier H. + Bühlmann J."]
[45,"Lenja","120.1197.2405.4","2015-11-01","#CARNAVAL","Lana","Hischier H. + Bühlmann J."]
[46,"Safira","120.1188.2113.6","2015-10-01","@BISCOTTO","Safira","Hischier Pius"]
[47,"Pablo","120.0990.3391.7","2013-12-01","$SATYR","Puma","Hischier Pius"]
[48,"Pelila","120.0990.3390.0","2013-12-01","$SATYR","Puma","Hischier Pius"]
[49,"Shakira","120.0623.7070.4","2013-12-01","@VALENTINO","Safira","Hischier Pius"]
[50,"Sera","120.1151.1686.0","2014-10-01","ZETOR","Brunette","Jäger Carlo"]
[51,"Guxa","120.0764.2445.5","2009-10-01","XAVER","Yakin","Jäger Carlo"]
[52,"Maila","120.1055.8462.4","2012-11-01","RAMBAR","Mona","Jäger Carlo"]
[53,"Tzigane","120.1151.1699.0","2015-10-01","MILOU","Tigresse","Jäger Carlo"]
[54,"Paloma","120.1068.9664.1","2013-03-01","NERO","Princesse","Jäger Carlo"]
[55,"Candice","120.1151.1687.7","2014-11-01","MILOU","Pinda","Jäger Carlo"]
[56,"Pisa","120.1068.9667.2","2013-10-01","FAKIR","Pomette","Jäger Carlo"]
[57,"Promise","120.0836.1545.7","2009-10-01","FRANCO","Princesse","Jäger Carlo"]
[58,"Turin","120.1042.9272.8","2012-10-01","NERO","Turco","Jäger Carlo"]
[59,"Baghira","120.0931.3517.4","2013-11-01","@CACTUS","Baghira ","Mathieu Leander + S."]
[60,"Bambino","120.0931.3525.9","2013-10-01","@NATI","Bambi","Mathieu Leander + S."]
[61,"Baronesse","120.0931.3527.3","2014-02-01","@BISON","Baron","Mathieu Leander + S."]
[62,"Bavaria","120.0930.1107.2","2012-10-01","$TARTUFF","Boa","Mathieu Leander + S."]
[63,"Belon","120.0765.3580.9","2008-11-01","@CAPSULE","Bandit","Mathieu Leander + S."]
[64,"Bonita","120.0930.1109.6","2012-10-01","$VITO","Belon","Mathieu Leander + S."]
[65,"Bijou","120.1201.2201.6","2014-11-01","@MAC","Baquera","Mathieu Leander + S."]
[66,"Babylon","120.1201.2202.3","2014-12-01","SHACARI","Barillo","Mathieu Leander + S."]
[67,"Ballerine","120.1188.5412.7","2014-12-01","CACTUS","Bombache","Stallung Passeraub"]
[68,"Bulle","120.1118.3996.1","2013-11-01","#NAT","Berenice","Stallung Passeraub"]
[69,"Manou","120.1118.3994.7","2013-11-01","MALI","Mamou","Stallung Passeraub "]
[70,"Medusa","120.1064.0583.6","2013-10-01","MALI","Mitis","Stallung Passeraub "]
[71,"Bonita","120.1118.4001.1","2014-01-01","MALI","Bombache","Stallung Passeraub "]
[72,"Mirette","120.0623.0762.5","2008-10-01","@BRONSON","Moustique","Stallung Passeraub"]
[73,"Baghera","120.1118.3998.5","2013-11-01","MALI","Berenice","Stallung Passeraub"]
[74,"Bobino","120.1118.4000.4","2013-11-01","#NAT","Berenice","Stallung Passeraub"]
[75,"Pandora","120.0806.0680.9","2012-12-01","@POLUX","Gibsy","Stallung zum Stäg"]
[76,"Babylon","120.1062.2041.5","2015-10-01","@DARIUS","Benika","Stallung zum Stäg"]
[77,"Benika","120.1036.6445.8","2013-01-01","GITAN","Benichou","Stallung zum Stäg"]
[78,"Diaries","120.0990.8567.1","2012-12-01","CLINTON","Orcas","Stallung zum Stäg"]
[79,"Tabhita","120.0924.5768.0","2011-12-01","@TOSKANI","Turon","Sewer R. + Thommen S."]
[80,"Tiara","120.0924.5773.4","2012-11-01","@LUCA","Track","Sewer R. + Thommen S."]
[81,"Biscot","120.1255.5712.7","2015-11-01","POUDRE","Bobino","Sewer R. + Thommen S."]
[82,"Bolera","120.1188.0914.1","2015-10-01","FABIUS-FAROUK","Bango","Sewer R. + Thommen S."]
[83,"Carolin","120.1086.2394.8","2014-09-01","@NOUNOURS","Cuba","Tscherry E. + B."]
[84,"Cobra","120.0942.4296.3","2011-11-01","@PICADOR","Cuba","Tscherry E. + B."]
[85,"Vivana","120.0923.7668.4","2011-11-01","BEN ","Violine","Williner Anton"]
[86,"Tigra","120.0955.4046.4","2012-01-01","BEN","Tina","Williner Anton"]
[87,"Vanessa","120.0955.4060.0","2012-11-01","CHUCK","Vallesia","Williner Anton"]
[88,"Colonell","120.0687.0260.8","2013-11-01","VARIO","Carmelin","Williner Anton"]
[89,"Diva","120.0687.0255.4","2013-11-01","BENO","Dorin","Williner Anton"]
[90,"Tira","120.0955.4058.7","2012-11-01","CHUCK","Tomba","Williner Anton"]
[91,"Xandria","120.1256.8890.6","2015-11-01","#TORRO","Xenia","Wyssen Diego u. Madlen"]
[92,"Rasta","120.1256.8888.3","2015-11-01","#TORRO","Ranja","Wyssen Diego u. Madlen"]
[93,"Xana","120.1256.8886.9","2015-10-01","$TERREUR","Xantia","Wyssen Diego u. Madlen"]
[94,"Xanja","120.1118.6567.0","2013-11-01","#TURBULENCE","Xenia","Wyssen Diego u. Madlen"]
[95,"Xena","120.1118.6566.3","2013-11-01","FOUDRE","Xera","Wyssen Diego u. Madlen"]
[96,"Xhyla","120.1127.8750.6","2014-10-01","#TURBULENCE","Xenia","Wyssen Diego u. Madlen"]
[97,"Napapiri","120.1054.6787.3","2012-10-01","BIMI","Nana","Zumoberhaus P. + Familie"]
[98,"Ninja","120.1258.8838.2","2015-12-01","TAO","Nana","Zumoberhaus P. + Familie"]
[99,"Rena","120.1269.9552.2","2016-01-01","@CARIBOU","Ruby","Zumofen / Gattlen"]
[100,"Ahkira","120.1118.4004.2","2014-10-01","$BREONA","Arizona","Zumofen / Gattlen"]
[101,"Fangio","120.1095.6908.5","2013-11-01","RAMBO","Fiasco","Zumofen / Gattlen"]
[102,"Fayola","120.0708.7750.9","2014-09-01","#VOLERIO","Fiorenza","Zumofen / Gattlen"]
[103,"Milou","120.0944.5559.2","2011-10-01","NESTOR","Pinson","Zumofen / Gattlen"]
[104,"Adonis","120.1201.9788.5","2015-11-01","#CAPO","Adonis","Zumofen / Gattlen"]
[105,"Puma","120.0875.3387.0","2010-11-01","@CARIBOU","Puma","Zumofen / Gattlen"]
[106,"Rambo","120.0708.7749.3","2014-09-01","#VOLERIO","Rocky ","Zumofen / Gattlen"]
[107,"Violin","120.0708.7752.3","2013-11-01","$VITUS","Volero","Zumofen / Gattlen"]
[108,"Violette","120.1201.9782.3","2015-09-01","$BREONA","Volero ","Zumofen / Gattlen"]
[109,"Vulcana","120.0708.7755.4","2014-10-01","@GLOU-GLOU","Vandale","Zumofen / Gattlen"]
[110,"Xena","120.1051.2928.3","2012-10-01","@CARIBOU","Xenti","Zumofen / Gattlen"]
[111,"Vidona","120.1201.9780.9","2015-09-01","$BREONA","Volero","Zumofen / Gattlen"]
[112,"Riva ","120.1201.9784.7","2015-10-01","#CAPO","Rocky ","Zumofen / Gattlen"]
[113,"Vanda","120.1201.9781.6","2015-09-01","$BREONA","Volero ","Zumofen / Gattlen"]